program: Orca
programVersion: 5.0.2
elementType: C C C C C C H H H H H C O N C C C C C H C H H F C O N H C C C C C C H H Br C F F F C F C F F F C F F F C H H H
charge: 0
multiplicity: 1
keywords: wb97x-d3
keywords: def2-TZVPP
keywords: def2/J RIJCOSX
keywords: DEFGRID2
keywords: scfconv7
keywords: smallprint printgap noloewdin
keywords: NOSOSCF
formula: C25H14BrF11N2O2
InChI: InChI=1/C25H14BrF11N2O2/c1-39(21(41)12-6-3-2-4-7-12)17-9-5-8-14(18(17)27)20(40)38-19-15(23(29,30)31)10-13(11-16(19)26)22(28,24(32,33)34)25(35,36)37/h2-11,38H,1H3
55 atoms
C  -0.663274 -4.474606 3.49443
C  0.674537 -4.119667 3.388245
C  1.373035 -4.39565 2.22024
C  0.731761 -5.00997 1.15604
C  -0.620415 -5.330761 1.244847
C  -1.312691 -5.073904 2.425576
H  -1.205644 -4.283986 4.410934
H  1.175667 -3.641807 4.219801
H  2.419789 -4.135569 2.138234
H  1.281044 -5.22146 0.247526
H  -2.353474 -5.351482 2.527125
C  -1.26267 -6.001665 0.077038
O  -0.717509 -6.946308 -0.47788
N  -2.472526 -5.545156 -0.336062
C  -2.982435 -4.298136 0.084581
C  -2.258323 -3.134079 -0.135214
C  -4.215744 -4.201671 0.71195
C  -2.677979 -1.892383 0.324651
C  -4.686501 -2.971878 1.139693
H  -4.793619 -5.10117 0.880994
C  -3.91926 -1.835877 0.960409
H  -5.645067 -2.903017 1.634093
H  -4.28317 -0.885839 1.324509
F  -1.10806 -3.249586 -0.810846
C  -1.927892 -0.606957 0.196137
O  -2.480306 0.455367 0.421053
N  -0.615634 -0.653355 -0.145785
H  -0.126926 -1.532957 -0.221006
C  0.133497 0.535322 -0.211591
C  1.033302 0.876497 0.798515
C  -0.004139 1.405034 -1.289097
C  1.763262 2.051815 0.731869
C  0.711435 2.589583 -1.358651
C  1.602404 2.914067 -0.344923
H  2.45153 2.297053 1.525699
H  0.563101 3.234291 -2.212249
Br -1.154252 0.96674 -2.703591
C  1.223577 -0.055397 1.966736
F  0.077993 -0.309937 2.605612
F  1.718914 -1.234547 1.568875
F  2.069798 0.438015 2.870258
C  2.386077 4.213892 -0.355039
F  3.341666 4.179777 0.627983
C  3.187775 4.432289 -1.660114
F  2.399288 4.701201 -2.696457
F  3.886132 3.337399 -1.939835
F  4.041952 5.43886 -1.5280
C  1.466738 5.401594 0.012868
F  0.931491 5.178487 1.208034
F  2.132221 6.549766 0.072285
F  0.479424 5.541139 -0.865136
C  -3.154218 -6.248068 -1.416966
H  -4.154918 -5.841876 -1.528149
H  -2.629794 -6.128554 -2.365478
H  -3.240896 -7.308993 -1.192533
elementType: C H O N F Br
totalener: -4893.89909115 hartree
nucrepener: 5941.15511706 hartree
twoeener: 7778.18659559 hartree
cpcmener: -0.04656612 hartree
kineticenergy: 4881.91743197 hartree
xcener: -271.442583987162 hartree
chargesum: -0.0000000
charge: -0.158498 -0.141463 -0.174405 -0.189023 0.026165 -0.181831 0.160626 0.161908 0.157904 0.143237 0.160830 0.435068 -0.534563 -0.074292 -0.024586 0.215549 -0.121544 -0.018423 -0.150455 0.163659 -0.097963 0.162490 0.148619 -0.216518 0.351942 -0.491563 -0.204481 0.207978 0.254984 -0.178061 -0.182571 -0.030197 0.000647 -0.082996 0.136235 0.129551 0.009682 0.543133 -0.177141 -0.177076 -0.171998 0.187768 -0.191950 0.483631 -0.154632 -0.153907 -0.151900 0.468667 -0.154002 -0.153612 -0.153908 -0.162027 0.112419 0.118256 0.114637
qa: -0.1585 -0.1415 -0.1744 -0.1890 0.0262 -0.1818 0.1606 0.1619 0.1579 0.1432 0.1608 0.4351 -0.5346 -0.0743 -0.0246 0.2155 -0.1215 -0.0184 -0.1505 0.1637 -0.0980 0.1625 0.1486 -0.2165 0.3519 -0.4916 -0.2045 0.2080 0.2550 -0.1781 -0.1826 -0.0302 0.0006 -0.0830 0.1362 0.1296 0.0097 0.5431 -0.1771 -0.1771 -0.1720 0.1878 -0.1920 0.4836 -0.1546 -0.1539 -0.1519 0.4687 -0.1540 -0.1536 -0.1539 -0.1620 0.1124 0.1183 0.1146
va: 3.9020 3.8574 3.8804 3.9790 3.4809 3.9443 0.9910 0.9882 0.9941 1.0172 0.9973 4.0278 1.9722 3.0861 3.7218 4.0220 3.9138 3.6504 3.9465 0.9979 3.9276 0.9908 1.0188 1.0864 4.0999 2.0092 3.1575 1.0091 3.6182 3.9729 4.1974 3.9363 3.9343 3.7674 1.0371 1.0298 1.2781 4.4117 1.1242 1.1265 1.1377 4.0605 1.1069 4.4795 1.1629 1.1644 1.1725 4.4773 1.1659 1.1705 1.1654 3.8794 0.9994 0.9928 0.9947
dispcorr: -0.035495865 hartree
energy: -4893.934587013397
dipole: -27.01732 25.74793 -1.26939 -81.37101 81.17339 -0.19762 34.55464 -34.17737 0.37727
magnitude: 1.33893 au
magnitude: 3.40329 debye
