program: Orca
programVersion: 5.0.2
elementType: C C C C C C H H H H H C O N C C C C C H C H H F C O N H C C C C C C H H Br C F F F C F C F F F C F F F C H H H
charge: 0
multiplicity: 1
keywords: wb97x-d3
keywords: def2-TZVPP
keywords: def2/J RIJCOSX
keywords: DEFGRID2
keywords: scfconv7
keywords: smallprint printgap noloewdin
keywords: NOSOSCF
formula: C25H14BrF11N2O2
InChI: InChI=1/C25H14BrF11N2O2/c1-39(21(41)12-6-3-2-4-7-12)17-9-5-8-14(18(17)27)20(40)38-19-15(23(29,30)31)10-13(11-16(19)26)22(28,24(32,33)34)25(35,36)37/h2-11,38H,1H3
55 atoms
C  0.391519 -3.927307 1.378226
C  1.319204 -3.426535 0.473747
C  1.118954 -3.598483 -0.890131
C  -0.00961 -4.261038 -1.348211
C  -0.960261 -4.730173 -0.445505
C  -0.748613 -4.572705 0.92179
H  0.550701 -3.809454 2.441765
H  2.198382 -2.906464 0.831378
H  1.842446 -3.216689 -1.598047
H  -0.163001 -4.387577 -2.412295
H  -1.465557 -4.953849 1.637526
C  -2.17001 -5.414839 -0.994322
O  -2.053742 -6.328143 -1.800776
N  -3.394193 -5.00196 -0.572806
C  -3.561729 -3.871847 0.250679
C  -3.032395 -2.645728 -0.125048
C  -4.237057 -3.947921 1.462564
C  -3.023079 -1.555177 0.726408
C  -4.336745 -2.836336 2.283829
H  -4.66855 -4.892429 1.768745
C  -3.714794 -1.649979 1.929729
H  -4.867761 -2.908064 3.222555
H  -3.740272 -0.802015 2.601136
F  -2.485697 -2.52689 -1.338615
C  -2.252375 -0.312996 0.434547
O  -2.713877 0.800527 0.602009
N  -0.97012 -0.523958 0.049277
H  -0.589255 -1.461836 0.019542
C  -0.067234 0.545472 -0.094864
C  0.206898 1.092989 -1.34539
C  0.586453 1.070116 1.014787
C  1.095086 2.147254 -1.477109
C  1.480605 2.121531 0.896253
C  1.731842 2.664979 -0.356662
H  1.288969 2.562581 -2.453963
H  1.965142 2.495563 1.786073
Br 0.264024 0.329548 2.708723
C  -0.462455 0.510505 -2.561797
F  -0.14606 -0.778425 -2.72577
F  -1.794406 0.585109 -2.481309
F  -0.107063 1.143503 -3.680137
C  2.669367 3.844715 -0.535838
F  2.890284 4.059501 -1.870828
C  2.00247 5.141777 -0.020812
F  1.687115 5.045823 1.266166
F  0.886101 5.351596 -0.709364
F  2.78179 6.205716 -0.176822
C  4.078415 3.587416 0.051797
F  4.51408 2.396967 -0.344814
F  4.945243 4.498464 -0.372247
F  4.073725 3.608945 1.381884
C  -4.570996 -5.741414 -1.015469
H  -4.579819 -6.754202 -0.611843
H  -5.462433 -5.224049 -0.672537
H  -4.609471 -5.793481 -2.103473
elementType: C H O N F Br
totalener: -4893.89746403 hartree
nucrepener: 6059.60115065 hartree
twoeener: 7895.78079716 hartree
cpcmener: -0.05000150 hartree
kineticenergy: 4881.91712562 hartree
xcener: -271.442060193968 hartree
chargesum: -0.0000000
charge: -0.149961 -0.140567 -0.181298 -0.159776 0.007198 -0.157561 0.154726 0.155141 0.156749 0.144220 0.156497 0.433531 -0.534462 -0.070945 -0.002055 0.188355 -0.130878 0.003122 -0.151419 0.164296 -0.151408 0.162878 0.153967 -0.203843 0.372563 -0.489740 -0.229319 0.233038 0.263976 -0.192730 -0.228681 -0.002634 0.024235 -0.088171 0.138036 0.129276 0.009140 0.535058 -0.172521 -0.173226 -0.172144 0.180664 -0.191863 0.469461 -0.153459 -0.153856 -0.153576 0.484724 -0.153908 -0.151944 -0.154329 -0.174375 0.124857 0.115580 0.109364
qa: -0.1500 -0.1406 -0.1813 -0.1598 0.0072 -0.1576 0.1547 0.1551 0.1567 0.1442 0.1565 0.4335 -0.5345 -0.0709 -0.0021 0.1884 -0.1309 0.0031 -0.1514 0.1643 -0.1514 0.1629 0.1540 -0.2038 0.3726 -0.4897 -0.2293 0.2330 0.2640 -0.1927 -0.2287 -0.0026 0.0242 -0.0882 0.1380 0.1293 0.0091 0.5351 -0.1725 -0.1732 -0.1721 0.1807 -0.1919 0.4695 -0.1535 -0.1539 -0.1536 0.4847 -0.1539 -0.1519 -0.1543 -0.1744 0.1249 0.1156 0.1094
va: 3.8561 3.8095 3.8837 3.9450 3.5076 3.9118 0.9944 0.9934 0.9944 1.0146 0.9968 4.0424 1.9726 3.1202 3.7247 4.0427 3.9088 3.5401 3.9376 0.9951 3.9523 0.9893 1.0075 1.1020 4.1319 2.0140 3.0424 0.9824 3.5114 4.0032 4.2163 3.8940 3.8986 3.7759 1.0360 1.0300 1.2812 4.4400 1.1271 1.1304 1.1344 4.0677 1.1079 4.4781 1.1652 1.1664 1.1704 4.4765 1.1642 1.1726 1.1630 3.8839 0.9878 0.9990 0.9980
dispcorr: -0.038871477 hartree
energy: -4893.936335509097
dipole: -39.53099 39.63900 0.10801 -69.82451 69.17501 -0.64950 -10.82798 13.21751 2.38953
magnitude: 2.47858 au
magnitude: 6.30005 debye
