program: Orca
programVersion: 5.0.2
elementType: C C C C C C H H H H H C O N C C C C C H C H H F C O N H C C C C C C H H Br C F F F C F C F F F C F F F C H H H
charge: 0
multiplicity: 1
keywords: wb97x-d3
keywords: def2-TZVPP
keywords: def2/J RIJCOSX
keywords: DEFGRID2
keywords: scfconv7
keywords: smallprint printgap noloewdin
keywords: NOSOSCF
formula: C25H14BrF11N2O2
InChI: InChI=1/C25H14BrF11N2O2/c1-39(21(41)12-6-3-2-4-7-12)17-9-5-8-14(18(17)27)20(40)38-19-15(23(29,30)31)10-13(11-16(19)26)22(28,24(32,33)34)25(35,36)37/h2-11,38H,1H3
55 atoms
C  1.206487 -5.87895 2.021557
C  1.445841 -7.236799 1.857077
C  0.380257 -8.124315 1.791832
C  -0.921189 -7.65583 1.891325
C  -1.164256 -6.292233 2.026494
C  -0.094297 -5.404561 2.098667
H  2.034663 -5.185412 2.089112
H  2.461861 -7.603446 1.786569
H  0.56181 -9.1842 1.668796
H  -1.74931 -8.352421 1.848394
H  -0.267427 -4.344942 2.237866
C  -2.576948 -5.833247 2.179666
O  -3.311621 -6.343327 3.010437
N  -3.006883 -4.824143 1.380605
C  -2.293237 -4.402324 0.23785
C  -1.851107 -3.088104 0.156671
C  -2.0446 -5.250096 -0.831476
C  -1.193195 -2.595534 -0.957173
C  -1.369435 -4.787269 -1.951359
H  -2.388056 -6.275564 -0.783828
C  -0.966874 -3.466168 -2.022306
H  -1.176966 -5.455621 -2.779204
H  -0.462496 -3.101292 -2.907334
F  -2.099347 -2.285222 1.19612
C  -0.784478 -1.169763 -1.118459
O  -0.993646 -0.574498 -2.156307
N  -0.136254 -0.593473 -0.076811
H  0.106392 -1.126936 0.746892
C  0.261325 0.75432 -0.158611
C  1.55741 1.100248 -0.540442
C  -0.639545 1.776785 0.118479
C  1.937763 2.428025 -0.640833
C  -0.267546 3.108521 0.026763
C  1.025414 3.436022 -0.352926
H  2.94532 2.659212 -0.950892
H  -0.992071 3.878856 0.250498
Br -2.393126 1.357192 0.632602
C  2.559424 0.010736 -0.823748
F  2.134242 -0.839717 -1.762573
F  3.724005 0.502302 -1.247891
F  2.815681 -0.711454 0.274629
C  1.367503 4.906121 -0.49838
F  0.519721 5.65392 0.277383
C  2.788582 5.275614 -0.000949
F  3.727129 4.934773 -0.881526
F  3.046624 4.65273 1.143039
F  2.888461 6.57995 0.213837
C  1.110447 5.35027 -1.956655
F  1.828441 4.618434 -2.801414
F  -0.174718 5.182311 -2.249161
F  1.407882 6.630695 -2.151292
C  -4.361357 -4.319541 1.575696
H  -4.560453 -3.532429 0.854213
H  -5.099837 -5.107402 1.422978
H  -4.487328 -3.90908 2.576696
elementType: C H O N F Br
totalener: -4893.91383458 hartree
nucrepener: 5794.07849985 hartree
twoeener: 7630.18351773 hartree
cpcmener: -0.04199121 hartree
kineticenergy: 4881.91238124 hartree
xcener: -271.434347978569 hartree
chargesum: -0.0000000
charge: -0.155997 -0.137285 -0.161638 -0.197422 -0.000305 -0.174581 0.156905 0.159451 0.157350 0.143820 0.158309 0.427861 -0.500106 -0.075295 -0.071249 0.278675 -0.124775 0.015628 -0.173741 0.155157 -0.117278 0.158754 0.153372 -0.211437 0.326369 -0.458203 -0.221705 0.206606 0.226370 -0.151941 -0.152553 -0.059748 -0.055341 -0.047173 0.145474 0.130814 0.012398 0.529081 -0.168175 -0.170359 -0.173425 0.196800 -0.191397 0.484258 -0.154919 -0.152505 -0.148969 0.463184 -0.152218 -0.153269 -0.152953 -0.166331 0.113406 0.114193 0.118057
qa: -0.1560 -0.1373 -0.1616 -0.1974 -0.0003 -0.1746 0.1569 0.1595 0.1573 0.1438 0.1583 0.4279 -0.5001 -0.0753 -0.0712 0.2787 -0.1248 0.0156 -0.1737 0.1552 -0.1173 0.1588 0.1534 -0.2114 0.3264 -0.4582 -0.2217 0.2066 0.2264 -0.1519 -0.1526 -0.0597 -0.0553 -0.0472 0.1455 0.1308 0.0124 0.5291 -0.1682 -0.1704 -0.1734 0.1968 -0.1914 0.4843 -0.1549 -0.1525 -0.1490 0.4632 -0.1522 -0.1533 -0.1530 -0.1663 0.1134 0.1142 0.1181
va: 3.9155 3.8948 3.9198 3.9964 3.5525 3.9331 0.9927 0.9891 0.9916 1.0154 0.9977 4.0399 2.0183 3.0450 3.7463 3.9417 3.9477 3.5929 3.9597 1.0010 3.9341 0.9926 1.0072 1.0835 4.1362 2.0480 3.1205 0.9950 3.6381 4.0007 4.1898 3.9439 3.9576 3.7947 1.0413 1.0298 1.2823 4.4576 1.1348 1.1365 1.1282 4.0535 1.1097 4.4833 1.1628 1.1657 1.1761 4.4751 1.1672 1.1692 1.1705 3.8862 0.9996 0.9965 0.9926
dispcorr: -0.033960849 hartree
energy: -4893.947795425323
dipole: -8.48379 9.52939 1.04560 -98.61220 98.19047 -0.42173 9.00039 -9.30243 -0.30204
magnitude: 1.16720 au
magnitude: 2.96680 debye
