program: Orca
programVersion: 5.0.2
elementType: C C C C C C H H H H H C O N C C C C C H C H H F C O N H C C C C C C H H Br C F F F C F C F F F C F F F C H H H
charge: 0
multiplicity: 1
keywords: wb97x-d3
keywords: def2-TZVPP
keywords: def2/J RIJCOSX
keywords: DEFGRID2
keywords: scfconv7
keywords: smallprint printgap noloewdin
keywords: NOSOSCF
formula: C25H14BrF11N2O2
InChI: InChI=1/C25H14BrF11N2O2/c1-39(21(41)12-6-3-2-4-7-12)17-9-5-8-14(18(17)27)20(40)38-19-15(23(29,30)31)10-13(11-16(19)26)22(28,24(32,33)34)25(35,36)37/h2-11,38H,1H3
55 atoms
C  0.2519 -8.59844 0.946663
C  1.396502 -7.84348 0.736124
C  1.377017 -6.477352 0.97638
C  0.209874 -5.86242 1.399625
C  -0.944476 -6.613266 1.597814
C  -0.909629 -7.988643 1.391167
H  0.266249 -9.666347 0.773776
H  2.305838 -8.320639 0.395192
H  2.272881 -5.887963 0.834536
H  0.213153 -4.799105 1.599264
H  -1.796195 -8.579216 1.580959
C  -2.214566 -6.020082 2.113806
O  -2.858194 -6.572048 2.977785
N  -2.620701 -4.814609 1.592014
C  -2.171107 -4.334531 0.346594
C  -1.612789 -3.064053 0.255563
C  -2.267573 -5.087743 -0.814374
C  -1.144661 -2.521681 -0.932779
C  -1.795578 -4.586102 -2.016528
H  -2.704516 -6.076307 -0.764795
C  -1.244446 -3.321114 -2.072863
H  -1.864943 -5.183987 -2.914301
H  -0.879262 -2.922332 -3.008497
F  -1.52443 -2.37006 1.404666
C  -0.515397 -1.171837 -1.125486
O  -0.077418 -0.844152 -2.201471
N  -0.471568 -0.326728 -0.051895
H  -0.751265 -0.647552 0.85918
C  0.130922 0.937177 -0.161399
C  1.362902 1.19861 0.439561
C  -0.490665 1.972023 -0.856345
C  1.943773 2.452106 0.356127
C  0.093522 3.225062 -0.95582
C  1.317712 3.468608 -0.35049
H  2.893386 2.631042 0.834604
H  -0.428215 3.994758 -1.50454
Br -2.167618 1.702801 -1.64076
C  2.064251 0.105995 1.201639
F  2.3097 -0.961486 0.442449
F  3.232383 0.51658 1.694351
F  1.32312 -0.304378 2.241084
C  1.986629 4.827822 -0.404933
F  3.278581 4.71456 0.038293
C  2.105583 5.382458 -1.847058
F  2.5253 4.424772 -2.663266
F  2.973892 6.380006 -1.907085
F  0.93218 5.829235 -2.297572
C  1.301052 5.804325 0.578566
F  1.429157 5.331296 1.813315
F  1.844604 7.014585 0.540908
F  0.003419 5.923468 0.31319
C  -3.818221 -4.220135 2.171085
H  -3.697108 -4.082316 3.24315
H  -3.999092 -3.252238 1.712928
H  -4.693881 -4.848889 2.004788
totalener: -4893.88857056 hartree
nucrepener: 5763.14718943 hartree
twoeener: 7599.74564974 hartree
kineticenergy: 4881.97515141 hartree
xcener: -271.442626527827 hartree
chargesum: -0.0000000
charge: -0.128839 -0.106220 -0.127555 -0.148844 -0.019793 -0.160104 0.128666 0.129630 0.128936 0.138809 0.126362 0.356070 -0.373541 -0.097093 -0.074040 0.240381 -0.099142 -0.049013 -0.119361 0.126944 -0.072232 0.131179 0.145998 -0.222329 0.297515 -0.362253 -0.224205 0.177859 0.234366 -0.205342 -0.141150 -0.043667 -0.041700 -0.081106 0.142254 0.128463 0.025184 0.527230 -0.158016 -0.163979 -0.174103 0.177393 -0.185446 0.477171 -0.144936 -0.140543 -0.156536 0.459577 -0.149057 -0.144408 -0.152440 -0.153554 0.115430 0.093921 0.111209
qa: -0.1288 -0.1062 -0.1276 -0.1488 -0.0198 -0.1601 0.1287 0.1296 0.1289 0.1388 0.1264 0.3561 -0.3735 -0.0971 -0.0740 0.2404 -0.0991 -0.0490 -0.1194 0.1269 -0.0722 0.1312 0.1460 -0.2223 0.2975 -0.3623 -0.2242 0.1779 0.2344 -0.2053 -0.1412 -0.0437 -0.0417 -0.0811 0.1423 0.1285 0.0252 0.5272 -0.1580 -0.1640 -0.1741 0.1774 -0.1854 0.4772 -0.1449 -0.1405 -0.1565 0.4596 -0.1491 -0.1444 -0.1524 -0.1536 0.1154 0.0939 0.1112
va: 3.9581 3.9487 3.9736 3.9752 3.6329 4.0317 1.0007 0.9985 1.0020 0.9988 1.0240 4.0842 2.1431 3.0191 3.8567 3.8682 4.0025 3.6949 3.9669 1.0102 3.9520 1.0028 1.0229 1.0637 4.1417 2.1439 3.1215 1.0453 3.6714 4.0233 4.2209 3.9375 3.9615 3.7914 1.0388 1.0328 1.2913 4.4631 1.1493 1.1447 1.1258 4.0745 1.1144 4.4844 1.1752 1.1885 1.1590 4.4849 1.1735 1.1824 1.1659 3.9056 0.9977 0.9999 0.9986
dispcorr: -0.032977678 hartree
energy: -4893.921548237073
dipole: -8.71091 8.34202 -0.36889 -103.84211 103.56458 -0.27753 18.81349 -19.40609 -0.59260
magnitude: 0.75118 au
magnitude: 1.90935 debye
