program: Orca
programVersion: 5.0.2
elementType: C C C C C C H H H H H C O N C C C C C H C H H F C O N H C C C C C C H H Br C F F F C F C F F F C F F F C H H H
charge: 0
multiplicity: 1
keywords: wb97x-d3
keywords: def2-TZVPP
keywords: def2/J RIJCOSX
keywords: DEFGRID2
keywords: scfconv7
keywords: smallprint printgap noloewdin
keywords: NOSOSCF
formula: C25H14BrF11N2O2
InChI: InChI=1/C25H14BrF11N2O2/c1-39(21(41)12-6-3-2-4-7-12)17-9-5-8-14(18(17)27)20(40)38-19-15(23(29,30)31)10-13(11-16(19)26)22(28,24(32,33)34)25(35,36)37/h2-11,38H,1H3
55 atoms
C  -0.658887 -8.518245 -0.430295
C  0.158318 -7.752275 -1.248648
C  0.493899 -6.45958 -0.874089
C  -0.008143 -5.923028 0.30025
C  -0.840291 -6.682202 1.117303
C  -1.143518 -7.990795 0.755422
H  -0.911586 -9.532033 -0.71111
H  0.542211 -8.166001 -2.171795
H  1.14837 -5.866195 -1.498313
H  0.275498 -4.919518 0.58805
H  -1.759599 -8.594883 1.408362
C  -1.358782 -6.183521 2.426915
O  -1.376812 -6.894947 3.40607
N  -1.792923 -4.879808 2.489611
C  -2.229805 -4.176495 1.349574
C  -1.693705 -2.927028 1.058106
C  -3.196175 -4.68578 0.494212
C  -2.076889 -2.172695 -0.041716
C  -3.589898 -3.969888 -0.624529
H  -3.629537 -5.653841 0.708754
C  -3.041379 -2.729331 -0.883128
H  -4.335747 -4.379135 -1.291237
H  -3.352458 -2.161639 -1.74841
F  -0.750906 -2.47143 1.903558
C  -1.555196 -0.82169 -0.437298
O  -1.981822 -0.256817 -1.414958
N  -0.575123 -0.2661 0.335971
H  -0.294749 -0.705757 1.195612
C  -0.069135 1.010692 0.042037
C  -0.422196 2.115834 0.8170
C  0.813554 1.207403 -1.016017
C  0.107216 3.368461 0.554993
C  1.332926 2.461652 -1.295402
C  0.98456 3.548804 -0.50569
H  -0.175573 4.205579 1.173335
H  2.012529 2.562011 -2.12751
Br 1.359549 -0.241254 -2.066926
C  -1.396123 1.93199 1.9515
F  -0.912074 1.087553 2.874798
F  -1.660244 3.078334 2.576512
F  -2.558244 1.436769 1.528152
C  1.553504 4.932911 -0.759457
F  0.974321 5.832399 0.097433
C  3.062487 4.983627 -0.42487
F  3.236396 4.605597 0.836664
F  3.55837 6.206167 -0.559615
F  3.763864 4.165998 -1.20605
C  1.206547 5.44984 -2.176696
F  -0.094165 5.30202 -2.391991
F  1.503931 6.734077 -2.311864
F  1.86369 4.774173 -3.118576
C  -2.20887 -4.387622 3.796438
H  -3.108772 -4.895477 4.146846
H  -1.421219 -4.544872 4.529339
H  -2.416611 -3.323483 3.733154
totalener: -4893.88887017 hartree
nucrepener: 5766.98568172 hartree
twoeener: 7603.51567738 hartree
kineticenergy: 4881.97008756 hartree
xcener: -271.441591929370 hartree
chargesum: 0.0000000
charge: -0.126716 -0.106988 -0.125349 -0.147118 -0.022214 -0.157502 0.128419 0.128895 0.125896 0.137395 0.126531 0.353110 -0.372734 -0.100466 -0.068903 0.234448 -0.098478 -0.045479 -0.119112 0.127582 -0.073121 0.131786 0.146976 -0.222680 0.297088 -0.362584 -0.226252 0.179493 0.251796 -0.217179 -0.171046 -0.019757 -0.018560 -0.099207 0.142602 0.126115 0.024506 0.524743 -0.174551 -0.163934 -0.155140 0.180484 -0.185433 0.462877 -0.148995 -0.143227 -0.153880 0.471307 -0.145655 -0.141946 -0.155608 -0.152776 0.111153 0.114083 0.095306
qa: -0.1267 -0.1070 -0.1253 -0.1471 -0.0222 -0.1575 0.1284 0.1289 0.1259 0.1374 0.1265 0.3531 -0.3727 -0.1005 -0.0689 0.2344 -0.0985 -0.0455 -0.1191 0.1276 -0.0731 0.1318 0.1470 -0.2227 0.2971 -0.3626 -0.2263 0.1795 0.2518 -0.2172 -0.1710 -0.0198 -0.0186 -0.0992 0.1426 0.1261 0.0245 0.5247 -0.1746 -0.1639 -0.1551 0.1805 -0.1854 0.4629 -0.1490 -0.1432 -0.1539 0.4713 -0.1457 -0.1419 -0.1556 -0.1528 0.1112 0.1141 0.0953
va: 3.9579 3.9511 3.9718 3.9771 3.6381 4.0319 1.0009 0.9987 1.0026 0.9981 1.0244 4.0863 2.1424 3.0152 3.8569 3.8860 3.9990 3.6925 3.9659 1.0098 3.9527 1.0026 1.0226 1.0635 4.1401 2.1440 3.1112 1.0449 3.6442 4.0318 4.2406 3.9178 3.9463 3.7657 1.0366 1.0334 1.2918 4.4685 1.1253 1.1451 1.1517 4.0817 1.1145 4.4858 1.1721 1.1854 1.1634 4.4844 1.1757 1.1872 1.1597 3.9059 0.9976 0.9994 0.9999
dispcorr: -0.032984013 hartree
energy: -4893.921854184540
dipole: -37.45507 37.35475 -0.10032 -88.36521 87.90767 -0.45753 26.14599 -26.70934 -0.56335
magnitude: 0.73264 au
magnitude: 1.86223 debye
