program: Orca
programVersion: 5.0.2
elementType: C C C C C C H H H H H C O N C C C C C H C H H F C O N H C C C C C C H H Br C F F F C F C F F F C F F F C H H H
charge: 0
multiplicity: 1
keywords: wb97x-d3
keywords: def2-TZVPP
keywords: def2/J RIJCOSX
keywords: DEFGRID2
keywords: scfconv7
keywords: smallprint printgap noloewdin
keywords: NOSOSCF
formula: C25H14BrF11N2O2
InChI: InChI=1/C25H14BrF11N2O2/c1-39(21(41)12-6-3-2-4-7-12)17-9-5-8-14(18(17)27)20(40)38-19-15(23(29,30)31)10-13(11-16(19)26)22(28,24(32,33)34)25(35,36)37/h2-11,38H,1H3
55 atoms
C  1.620053 -4.616866 1.776143
C  1.066042 -4.270705 3.000686
C  -0.280757 -4.498365 3.236886
C  -1.080311 -5.041693 2.242733
C  -0.533911 -5.371085 1.006306
C  0.827367 -5.176642 0.789054
H  2.673751 -4.454857 1.592577
H  1.685588 -3.833341 3.77225
H  -0.713653 -4.248273 4.196137
H  -2.127609 -5.219295 2.44635
H  1.259452 -5.463879 -0.160209
C  -1.323441 -5.994485 -0.098919
O  -0.866232 -6.89596 -0.764172
N  -2.597395 -5.52587 -0.325021
C  -3.049491 -4.279631 0.147484
C  -2.33213 -3.113308 -0.095379
C  -4.23971 -4.176981 0.855226
C  -2.720677 -1.877818 0.401636
C  -4.683561 -2.949834 1.317597
H  -4.806569 -5.077874 1.054557
C  -3.925532 -1.814897 1.099792
H  -5.612765 -2.882259 1.865931
H  -4.254865 -0.85497 1.471291
F  -1.221029 -3.216716 -0.835572
C  -1.978019 -0.586212 0.24524
O  -2.534568 0.469612 0.424003
N  -0.647052 -0.650119 -0.066928
H  -0.166027 -1.534264 -0.083418
C  0.109487 0.530032 -0.142181
C  1.042298 0.854982 0.844263
C  -0.052749 1.414548 -1.206517
C  1.777077 2.026217 0.768929
C  0.665809 2.597564 -1.2759
C  1.58744 2.907767 -0.285675
H  2.492611 2.255113 1.542195
H  0.496947 3.253531 -2.116294
Br -1.224483 0.998199 -2.604805
C  1.27088 -0.090942 1.99453
F  1.755248 -1.261991 1.554575
F  2.154488 0.391656 2.869798
F  0.152836 -0.352812 2.669202
C  2.39106 4.194262 -0.309057
F  3.354659 4.147115 0.665142
C  3.177027 4.376222 -1.628868
F  3.811221 3.248336 -1.928013
F  4.080354 5.339187 -1.521273
F  2.36852 4.680654 -2.643606
C  1.496993 5.403219 0.054827
F  0.999556 5.220422 1.271841
F  2.17511 6.544695 0.053521
F  0.482728 5.524754 -0.796078
C  -3.375444 -6.194343 -1.358667
H  -3.368131 -7.270728 -1.204065
H  -4.402335 -5.840504 -1.315266
H  -2.979894 -5.99061 -2.355037
totalener: -4893.88686848 hartree
nucrepener: 5941.28962770 hartree
twoeener: 7778.31936276 hartree
kineticenergy: 4881.97537715 hartree
xcener: -271.443726748299 hartree
chargesum: -0.0000000
charge: -0.143623 -0.106271 -0.129889 -0.146878 0.010310 -0.147257 0.128509 0.130179 0.126634 0.126999 0.124699 0.356113 -0.375790 -0.101577 -0.071167 0.217044 -0.142639 -0.038251 -0.115211 0.145132 -0.081348 0.132584 0.142534 -0.207403 0.311480 -0.361689 -0.210943 0.170278 0.230639 -0.198551 -0.151626 -0.036550 -0.030640 -0.092194 0.139995 0.127497 0.026560 0.541399 -0.173649 -0.166651 -0.161182 0.177739 -0.186390 0.474034 -0.148871 -0.141098 -0.155810 0.462944 -0.146808 -0.145272 -0.151621 -0.156898 0.114759 0.090579 0.115105
qa: -0.1436 -0.1063 -0.1299 -0.1469 0.0103 -0.1473 0.1285 0.1302 0.1266 0.1270 0.1247 0.3561 -0.3758 -0.1016 -0.0712 0.2170 -0.1426 -0.0383 -0.1152 0.1451 -0.0813 0.1326 0.1425 -0.2074 0.3115 -0.3617 -0.2109 0.1703 0.2306 -0.1986 -0.1516 -0.0366 -0.0306 -0.0922 0.1400 0.1275 0.0266 0.5414 -0.1736 -0.1667 -0.1612 0.1777 -0.1864 0.4740 -0.1489 -0.1411 -0.1558 0.4629 -0.1468 -0.1453 -0.1516 -0.1569 0.1148 0.0906 0.1151
va: 3.9268 3.9060 3.9678 3.9593 3.5733 4.0139 1.0018 0.9987 1.0016 1.0051 1.0245 4.1010 2.1412 3.0537 3.7778 3.9769 3.9329 3.7195 3.9685 1.0030 3.9725 1.0016 1.0205 1.0937 4.1436 2.1403 3.1416 1.0334 3.6836 4.0072 4.2322 3.9345 3.9687 3.7883 1.0389 1.0329 1.2914 4.4156 1.1279 1.1427 1.1454 4.0796 1.1130 4.4850 1.1706 1.1878 1.1598 4.4833 1.1762 1.1818 1.1670 3.8978 0.9990 0.9980 0.9964
dispcorr: -0.035174485 hartree
energy: -4893.922042969471
dipole: -25.80187 24.94605 -0.85583 -81.79496 81.52954 -0.26542 32.75742 -32.33415 0.42326
magnitude: 0.99098 au
magnitude: 2.51887 debye
