program: Orca
programVersion: 5.0.2
elementType: F F F F F F O O O N N C C C C C C C C C C C C C C C C C C C C C C C C H H H H H H H H H H H H H H H H H H H H H H H H H H
charge: 0
multiplicity: 1
keywords: wb97x-d3
keywords: def2-TZVPP
keywords: def2/J RIJCOSX
keywords: DEFGRID2
keywords: scfconv7
keywords: smallprint printgap noloewdin
keywords: NOSOSCF
formula: C24H26F6N2O3
InChI: InChI=1/C24H26F6N2O3/c1-2-10-33-21-11-15(23(25,26)27)6-8-20(21)34-19-12-17-4-3-5-18(13-19)32(17)35-22-9-7-16(14-31-22)24(28,29)30/h6-9,11,14,17-19H,2-5,10,12-13H2,1H3
61 atoms
F  7.908573 -0.198221 -0.135697
F  7.330956 -2.2515 0.082202
F  7.469526 -1.377511 -1.87848
F  -8.164909 1.205615 1.458177
F  -8.599315 -0.554605 0.311931
F  -7.961719 -0.739256 2.358851
O  1.762322 0.578756 -0.04523
O  -2.440771 -0.286912 -0.286488
O  3.28643 0.478091 2.011381
N  -2.095473 0.103555 -1.602996
N  -4.057455 -0.633304 1.185574
C  -1.550879 1.462473 -1.566951
C  -1.093243 -0.839748 -2.096031
C  -0.286288 1.575675 -0.704519
C  0.202175 -0.824156 -1.273086
C  0.787857 0.572493 -1.09589
C  -1.399927 1.890834 -3.029373
C  -0.919731 -0.53162 -3.585203
C  -0.572087 0.926854 -3.878334
C  3.005775 0.123549 -0.278131
C  -3.754696 -0.191466 -0.019591
C  3.850146 0.084156 0.854898
C  3.504067 -0.280231 -1.505062
C  -4.696925 0.331215 -0.90759
C  5.15921 -0.334127 0.72063
C  4.826839 -0.695591 -1.6357
C  5.651749 -0.717135 -0.530706
C  -6.007174 0.368872 -0.490737
C  -5.325584 -0.594111 1.572551
C  -6.344735 -0.107717 0.773486
C  4.091361 0.506462 3.185475
C  7.080518 -1.136279 -0.623506
C  -7.760125 -0.054078 1.230306
C  3.258821 1.043593 4.3268
C  2.769062 2.467436 4.111115
H  -2.310594 2.111086 -1.123338
H  -1.520812 -1.841539 -2.021351
H  -0.558858 1.418677 0.342802
H  0.101306 2.593953 -0.778507
H  0.92142 -1.495897 -1.746741
H  -0.003623 -1.238303 -0.282078
H  1.272105 0.911795 -2.011805
H  -0.974279 2.895244 -3.062446
H  -2.406038 1.966585 -3.449588
H  -1.857246 -0.786877 -4.084637
H  -0.158648 -1.197601 -3.995988
H  0.493928 1.101995 -3.729876
H  -0.752749 1.133777 -4.934907
H  2.882574 -0.276195 -2.389141
H  -4.419697 0.693377 -1.884486
H  5.809405 -0.362445 1.585069
H  5.178982 -0.992064 -2.613465
H  -6.759229 0.772193 -1.156693
H  -5.520402 -0.969135 2.56953
H  4.966174 1.146581 3.023571
H  4.452665 -0.501343 3.415805
H  2.416745 0.373628 4.517068
H  3.889537 1.001069 5.217425
H  2.267943 2.844126 5.002572
H  3.6000 3.140651 3.892527
H  2.059133 2.536331 3.286887
elementType: F O N C H
totalener: -1864.66859180 hartree
nucrepener: 3770.74307990 hartree
electener: -5635.41167170 hartree
twoeener: 4425.07082505 hartree
cpcmener: -0.03865296 hartree
kineticenergy: 1857.35430922 hartree
xcener: -168.786968701465 hartree
chargesum: 0.0000000
charge: -0.190408 -0.189715 -0.183792 -0.184396 -0.185202 -0.181164 -0.346774 -0.284239 -0.344006 -0.055932 -0.375062 0.103224 0.153149 -0.203333 -0.237322 0.143769 -0.211934 -0.222900 -0.120619 0.279685 0.390802 0.144481 -0.184288 -0.227551 -0.177623 -0.211591 -0.104891 -0.142913 0.012785 -0.069003 0.010610 0.559565 0.557724 -0.115284 -0.257581 0.103774 0.084190 0.095293 0.093432 0.104814 0.092490 0.094083 0.080611 0.093250 0.089840 0.080087 0.081715 0.082897 0.141813 0.157838 0.131161 0.151089 0.158212 0.135294 0.103041 0.113571 0.064750 0.068716 0.092157 0.078726 0.078887
qa: -0.1904 -0.1897 -0.1838 -0.1844 -0.1852 -0.1812 -0.3468 -0.2842 -0.3440 -0.0559 -0.3751 0.1032 0.1531 -0.2033 -0.2373 0.1438 -0.2119 -0.2229 -0.1206 0.2797 0.3908 0.1445 -0.1843 -0.2276 -0.1776 -0.2116 -0.1049 -0.1429 0.0128 -0.0690 0.0106 0.5596 0.5577 -0.1153 -0.2576 0.1038 0.0842 0.0953 0.0934 0.1048 0.0925 0.0941 0.0806 0.0932 0.0898 0.0801 0.0817 0.0829 0.1418 0.1578 0.1312 0.1511 0.1582 0.1353 0.1030 0.1136 0.0648 0.0687 0.0922 0.0787 0.0789
va: 1.1022 1.1005 1.1161 1.1041 1.1101 1.1215 2.0618 2.1038 2.0608 2.7729 3.0377 3.9156 3.9423 3.9523 3.8930 3.8566 3.9911 3.9621 3.9041 3.9436 4.0566 4.0406 3.8955 3.9322 3.9244 4.0214 3.7559 4.0359 4.0915 3.6236 3.8303 4.4282 4.4285 3.9362 3.9173 0.9955 1.0074 1.0308 1.0175 1.0110 1.0346 0.9953 1.0145 1.0068 1.0120 1.0137 1.0013 1.0088 1.0098 1.0202 1.0314 1.0083 1.0083 1.0132 0.9879 0.9921 1.0136 1.0107 1.0048 1.0027 1.0119
dispcorr: -0.031304216 hartree
energy: -1864.699896014547
dipole: 14.72814 -15.00631 -0.27817 19.25728 -18.14845 1.10883 -7.23796 5.36822 -1.86974
magnitude: 2.19153 au
magnitude: 5.57044 debye
