program: Orca
programVersion: 5.0.2
elementType: F F F F F F O O O N N C C C C C C C C C C C C C C C C C C C C C C C C H H H H H H H H H H H H H H H H H H H H H H H H H H
charge: 0
multiplicity: 1
keywords: wb97x-d3
keywords: def2-TZVPP
keywords: def2/J RIJCOSX
keywords: DEFGRID2
keywords: scfconv7
keywords: smallprint printgap noloewdin
keywords: NOSOSCF
formula: C24H26F6N2O3
InChI: InChI=1/C24H26F6N2O3/c1-2-10-33-21-11-15(23(25,26)27)6-8-20(21)34-19-12-17-4-3-5-18(13-19)32(17)35-22-9-7-16(14-31-22)24(28,29)30/h6-9,11,14,17-19H,2-5,10,12-13H2,1H3
61 atoms
F  7.213879 -1.405247 1.108594
F  7.85045 0.205445 -0.154259
F  7.358656 0.589195 1.902975
F  -8.476199 -0.966476 0.758252
F  -8.338652 -0.600319 -1.35109
F  -7.829499 -2.537089 -0.56597
O  1.670859 0.653987 -0.799666
O  -2.43216 0.271687 0.212812
O  3.113166 -1.045823 -2.03189
N  -2.122118 1.570379 0.68103
N  -3.988109 -1.204928 -0.320644
C  -1.073776 1.434321 1.691938
C  -1.643317 2.365004 -0.453402
C  0.21116 0.803347 1.13943
C  -0.39318 1.765047 -1.109055
C  0.729514 1.491855 -0.119186
C  -0.897097 2.821283 2.314633
C  -1.49422 3.798959 0.060259
C  -0.608138 3.923493 1.298038
C  2.925992 0.536335 -0.334537
C  -3.747451 0.015488 0.11827
C  3.728348 -0.406353 -1.017191
C  3.47014 1.25543 0.715731
C  -4.751457 0.928651 0.441225
C  5.040359 -0.594819 -0.629487
C  4.791954 1.058541 1.103647
C  5.57212 0.137516 0.436198
C  -6.055671 0.511531 0.300286
C  -5.249441 -1.59187 -0.453853
C  -6.325523 -0.777038 -0.154358
C  3.793509 -2.081381 -2.734142
C  6.990041 -0.111787 0.826413
C  -7.734599 -1.225749 -0.328369
C  3.837364 -3.39222 -1.970429
C  4.54796 -4.462337 -2.785305
H  -1.456692 0.77517 2.473831
H  -2.438365 2.37484 -1.203129
H  0.017672 -0.246177 0.90139
H  0.96369 0.80712 1.930511
H  -0.046101 2.439242 -1.894949
H  -0.669351 0.828075 -1.599991
H  1.224515 2.431569 0.128139
H  -0.102936 2.771851 3.061709
H  -1.816405 3.059868 2.854251
H  -2.495417 4.168455 0.294614
H  -1.114142 4.425509 -0.74845
H  0.445248 3.918161 1.017326
H  -0.776289 4.896066 1.764427
H  2.882598 1.982254 1.258312
H  -4.526291 1.921822 0.793961
H  5.662065 -1.314459 -1.146022
H  5.176234 1.63666 1.931721
H  -6.854676 1.197426 0.548109
H  -5.390197 -2.601247 -0.818875
H  4.798362 -1.757032 -3.024562
H  3.225657 -2.211042 -3.656256
H  4.346853 -3.265378 -1.01244
H  2.81648 -3.709537 -1.745601
H  4.567753 -5.411576 -2.251095
H  4.051235 -4.633045 -3.741701
H  5.581308 -4.18175 -2.994884
elementType: F O N C H
totalener: -1864.66657946 hartree
nucrepener: 3767.63261098 hartree
electener: -5632.29919044 hartree
twoeener: 4421.97460180 hartree
cpcmener: -0.03856419 hartree
kineticenergy: 1857.36638519 hartree
xcener: -168.790364630977 hartree
chargesum: 0.0000000
charge: -0.189852 -0.189849 -0.184109 -0.185058 -0.184289 -0.181506 -0.343805 -0.282831 -0.349384 -0.056796 -0.378064 0.155817 0.113148 -0.236594 -0.207540 0.137278 -0.222387 -0.207800 -0.122857 0.277866 0.383669 0.131240 -0.186793 -0.217874 -0.185199 -0.209043 -0.095247 -0.138583 0.013723 -0.072345 0.013494 0.558305 0.557860 -0.104816 -0.279002 0.083797 0.096177 0.091987 0.105539 0.093471 0.093896 0.095852 0.079908 0.090218 0.091996 0.079706 0.081018 0.082942 0.143042 0.155491 0.136867 0.151249 0.158494 0.135313 0.095271 0.116088 0.076820 0.070534 0.093937 0.084139 0.085470
qa: -0.1899 -0.1898 -0.1841 -0.1851 -0.1843 -0.1815 -0.3438 -0.2828 -0.3494 -0.0568 -0.3781 0.1558 0.1131 -0.2366 -0.2075 0.1373 -0.2224 -0.2078 -0.1229 0.2779 0.3837 0.1312 -0.1868 -0.2179 -0.1852 -0.2090 -0.0952 -0.1386 0.0137 -0.0723 0.0135 0.5583 0.5579 -0.1048 -0.2790 0.0838 0.0962 0.0920 0.1055 0.0935 0.0939 0.0959 0.0799 0.0902 0.0920 0.0797 0.0810 0.0829 0.1430 0.1555 0.1369 0.1512 0.1585 0.1353 0.0953 0.1161 0.0768 0.0705 0.0939 0.0841 0.0855
va: 1.1028 1.1014 1.1153 1.1101 1.1042 1.1212 2.0612 2.1074 2.0523 2.7837 3.0359 3.9457 3.9244 3.8861 3.9395 3.8624 3.9637 3.9848 3.9092 3.9468 4.0530 4.0313 3.9016 3.9365 3.9112 4.0192 3.7307 4.0311 4.0925 3.6288 3.8724 4.4310 4.4273 3.8495 3.9447 1.0073 1.0001 1.0353 1.0109 1.0176 1.0327 0.9951 1.0141 1.0110 1.0081 1.0147 1.0020 1.0087 1.0088 1.0243 1.0237 1.0085 1.0076 1.0133 0.9942 0.9944 1.0089 1.0137 1.0025 1.0014 1.0011
dispcorr: -0.031481384 hartree
energy: -1864.698060843167
dipole: 19.16101 -19.50145 -0.34044 13.19010 -11.08801 2.10209 -6.89460 7.31853 0.42393
magnitude: 2.17127 au
magnitude: 5.51893 debye
