program: Orca
programVersion: 5.0.2
elementType: F F F F F F O O O N N C C C C C C C C C C C C C C C C C C C C C C C C H H H H H H H H H H H H H H H H H H H H H H H H H H
charge: 0
multiplicity: 1
keywords: wb97x-d3
keywords: def2-TZVPP
keywords: def2/J RIJCOSX
keywords: DEFGRID2
keywords: scfconv7
keywords: smallprint printgap noloewdin
keywords: NOSOSCF
formula: C24H26F6N2O3
InChI: InChI=1/C24H26F6N2O3/c1-2-10-33-21-11-15(23(25,26)27)6-8-20(21)34-19-12-17-4-3-5-18(13-19)32(17)35-22-9-7-16(14-31-22)24(28,29)30/h6-9,11,14,17-19H,2-5,10,12-13H2,1H3
61 atoms
F  6.496936 -2.660467 -1.724231
F  7.415806 -1.409527 -0.234323
F  6.223901 -3.09086 0.365079
F  -7.605139 -0.8719 2.165207
F  -7.689905 -1.688087 0.172788
F  -6.550171 -2.68172 1.700857
O  1.790805 1.224327 -0.12101
O  -2.352995 1.388066 -0.155765
O  3.231247 0.788159 1.948548
N  -2.099579 1.659829 -1.5269
N  -4.285244 0.307398 -0.821794
C  -1.262198 2.861024 -1.536514
C  -1.361194 0.528557 -2.098782
C  0.051869 2.683723 -0.762832
C  -0.059511 0.227913 -1.348626
C  0.841541 1.447197 -1.171512
C  -1.099053 3.26708 -3.002099
C  -1.203319 0.820536 -3.591725
C  -0.53627 2.159954 -3.88915
C  2.844421 0.415454 -0.322724
C  -3.476964 0.720828 0.126654
C  3.63883 0.177073 0.821762
C  3.199878 -0.168634 -1.52618
C  -3.694877 0.487599 1.491526
C  4.74927 -0.636092 0.727234
C  4.321638 -0.989188 -1.615909
C  5.088774 -1.223843 -0.494688
C  -4.811807 -0.22181 1.84764
C  -5.368009 -0.37918 -0.462415
C  -5.678416 -0.675817 0.848116
C  3.945903 0.540684 3.154133
C  6.297998 -2.09361 -0.531569
C  -6.87904 -1.475067 1.213146
C  3.252695 1.27541 4.278427
C  1.825708 0.809607 4.52382
H  -1.827248 3.65636 -1.04596
H  -1.994979 -0.3557 -2.016519
H  -0.174288 2.618086 0.304392
H  0.661731 3.579691 -0.896543
H  0.460994 -0.574608 -1.874771
H  -0.305552 -0.16443 -0.358217
H  1.393089 1.656106 -2.089889
H  -0.469597 4.15759 -3.049784
H  -2.082388 3.562574 -3.375955
H  -2.200418 0.80719 -4.038927
H  -0.646867 0.001298 -4.050654
H  0.545296 2.085453 -3.772611
H  -0.69675 2.420225 -4.937161
H  2.614274 -0.004178 -2.419401
H  -2.999792 0.85486 2.233807
H  5.359747 -0.821215 1.60114
H  4.563358 -1.430339 -2.572565
H  -5.005533 -0.420846 2.893933
H  -6.002306 -0.701455 -1.278165
H  4.981046 0.883998 3.054405
H  3.968758 -0.535319 3.361562
H  3.853888 1.113712 5.175982
H  3.276852 2.35065 4.084012
H  1.176805 1.008708 3.670853
H  1.790822 -0.262688 4.725023
H  1.394938 1.319785 5.38533
elementType: F O N C H
totalener: -1864.66669894 hartree
nucrepener: 3816.94218443 hartree
electener: -5681.60888337 hartree
twoeener: 4471.55647628 hartree
cpcmener: -0.03625444 hartree
kineticenergy: 1857.37666392 hartree
xcener: -168.790789767809 hartree
chargesum: -0.0000000
charge: -0.183627 -0.190130 -0.190351 -0.185184 -0.181868 -0.184789 -0.346248 -0.291934 -0.343827 -0.032422 -0.378029 0.101200 0.135097 -0.204110 -0.253091 0.135682 -0.200346 -0.217380 -0.123997 0.268019 0.421773 0.148399 -0.182193 -0.248243 -0.176451 -0.215798 -0.102474 -0.099189 0.008539 -0.094261 0.009612 0.560293 0.556565 -0.116120 -0.255542 0.089634 0.096906 0.095184 0.094902 0.108512 0.098001 0.102638 0.077238 0.085784 0.088379 0.079570 0.080347 0.082033 0.144459 0.152353 0.131256 0.152375 0.160903 0.132942 0.113642 0.103998 0.068481 0.064650 0.077557 0.079094 0.091586
qa: -0.1836 -0.1901 -0.1904 -0.1852 -0.1819 -0.1848 -0.3462 -0.2919 -0.3438 -0.0324 -0.3780 0.1012 0.1351 -0.2041 -0.2531 0.1357 -0.2003 -0.2174 -0.1240 0.2680 0.4218 0.1484 -0.1822 -0.2482 -0.1765 -0.2158 -0.1025 -0.0992 0.0085 -0.0943 0.0096 0.5603 0.5566 -0.1161 -0.2555 0.0896 0.0969 0.0952 0.0949 0.1085 0.0980 0.1026 0.0772 0.0858 0.0884 0.0796 0.0803 0.0820 0.1445 0.1524 0.1313 0.1524 0.1609 0.1329 0.1136 0.1040 0.0685 0.0647 0.0776 0.0791 0.0916
va: 1.1168 1.1006 1.1023 1.1091 1.1206 1.1035 2.0573 2.1307 2.0594 2.7660 3.0313 3.9765 3.8879 3.9414 3.8911 3.8282 3.9639 3.9835 3.9072 3.9619 3.9489 4.0438 3.8896 4.0231 3.9264 4.0187 3.7519 3.9918 4.1017 3.6298 3.8292 4.4283 4.4277 3.9383 3.9168 1.0077 1.0073 1.0296 1.0153 1.0096 1.0292 0.9947 1.0142 1.0140 1.0129 1.0142 1.0039 1.0091 1.0073 1.0030 1.0319 1.0078 1.0032 1.0095 0.9917 0.9880 1.0111 1.0138 1.0135 1.0026 1.0048
dispcorr: -0.031219722 hartree
energy: -1864.697918663981
dipole: 12.94851 -12.61583 0.33268 36.69387 -35.43847 1.25540 -3.42756 3.43574 0.00817
magnitude: 1.29876 au
magnitude: 3.30119 debye
