program: Orca
programVersion: 5.0.2
elementType: F F F F F F O O O N N C C C C C C C C C C C C C C C C C C C C C C C C H H H H H H H H H H H H H H H H H H H H H H H H H H
charge: 0
multiplicity: 1
keywords: wb97x-d3
keywords: def2-TZVPP
keywords: def2/J RIJCOSX
keywords: DEFGRID2
keywords: scfconv7
keywords: smallprint printgap noloewdin
keywords: NOSOSCF
formula: C24H26F6N2O3
InChI: InChI=1/C24H26F6N2O3/c1-2-10-33-21-11-15(23(25,26)27)6-8-20(21)34-19-12-17-4-3-5-18(13-19)32(17)35-22-9-7-16(14-31-22)24(28,29)30/h6-9,11,14,17-19H,2-5,10,12-13H2,1H3
61 atoms
F  7.428654 -0.913405 1.426374
F  7.817191 0.104543 -0.424244
F  7.510266 1.235732 1.378438
F  -7.697256 -2.394772 -0.635047
F  -8.361061 -1.163806 0.993768
F  -8.236246 -0.341793 -0.989329
O  1.60697 0.179948 -0.509435
O  -2.400278 0.42242 0.777366
O  3.008363 -1.860134 -1.121311
N  -2.078501 1.795237 0.607323
N  -4.53986 0.952446 0.086602
C  -0.974003 2.061458 1.529642
C  -1.644562 2.013311 -0.776593
C  0.269021 1.20624 1.244314
C  -0.448415 1.140953 -1.169624
C  0.723775 1.266943 -0.210299
C  -0.736408 3.572639 1.495911
C  -1.436264 3.521645 -0.929315
C  -0.480659 4.126534 0.096137
C  2.901902 0.258633 -0.163409
C  -3.68082 0.088043 0.576499
C  3.681939 -0.86823 -0.510662
C  3.504437 1.328679 0.473646
C  -4.006991 -1.235934 0.896039
C  5.031516 -0.885338 -0.221117
C  4.865663 1.308005 0.76113
C  5.624264 0.209472 0.417522
C  -5.294432 -1.650197 0.667329
C  -5.785195 0.538899 -0.130203
C  -6.214825 -0.746578 0.129661
C  3.705998 -3.039045 -1.505212
C  7.086526 0.163995 0.701475
C  -7.621968 -1.157461 -0.126674
C  2.712948 -3.977131 -2.156442
C  3.381504 -5.270249 -2.595762
H  -1.321119 1.813697 2.53504
H  -2.47584 1.743511 -1.429569
H  0.048883 0.16455 1.492279
H  1.065812 1.521685 1.921109
H  -0.13585 1.404348 -2.182502
H  -0.769161 0.096388 -1.203696
H  1.253238 2.19894 -0.412162
H  0.095945 3.810273 2.161347
H  -1.620111 4.056199 1.919169
H  -2.41505 3.998432 -0.832972
H  -1.090556 3.725976 -1.944652
H  0.555404 3.959371 -0.199089
H  -0.604899 5.210822 0.109174
H  2.936623 2.201749 0.761116
H  -3.26449 -1.90624 1.306251
H  5.631757 -1.744942 -0.490245
H  5.298616 2.164457 1.257421
H  -5.575313 -2.668503 0.902496
H  -6.455847 1.28569 -0.536244
H  4.160103 -3.511749 -0.626958
H  4.512066 -2.789643 -2.20443
H  1.906732 -4.198383 -1.452926
H  2.259179 -3.484146 -3.019537
H  4.177728 -5.084139 -3.318036
H  3.818105 -5.802745 -1.74953
H  2.659978 -5.937724 -3.066207
elementType: F O N C H
totalener: -1864.66700646 hartree
nucrepener: 3764.67664827 hartree
electener: -5629.34365474 hartree
twoeener: 4419.24739495 hartree
cpcmener: -0.03629402 hartree
kineticenergy: 1857.37773815 hartree
xcener: -168.790975736894 hartree
chargesum: -0.0000000
charge: -0.190332 -0.189847 -0.184460 -0.184730 -0.183974 -0.182741 -0.342602 -0.296519 -0.337853 -0.030485 -0.377998 0.169361 0.076850 -0.245690 -0.195090 0.136332 -0.225852 -0.206582 -0.120715 0.282675 0.431381 0.135941 -0.183851 -0.253349 -0.183849 -0.216813 -0.100246 -0.090984 0.003897 -0.093432 0.030275 0.558061 0.554732 -0.091945 -0.280010 0.087629 0.096668 0.093188 0.104599 0.093373 0.094586 0.094251 0.079092 0.087885 0.086937 0.079210 0.080434 0.082765 0.141709 0.152299 0.131352 0.150258 0.158691 0.132103 0.097130 0.097676 0.064271 0.063898 0.083306 0.083148 0.093986
qa: -0.1903 -0.1898 -0.1845 -0.1847 -0.1840 -0.1827 -0.3426 -0.2965 -0.3379 -0.0305 -0.3780 0.1694 0.0768 -0.2457 -0.1951 0.1363 -0.2259 -0.2066 -0.1207 0.2827 0.4314 0.1359 -0.1839 -0.2533 -0.1838 -0.2168 -0.1002 -0.0910 0.0039 -0.0934 0.0303 0.5581 0.5547 -0.0919 -0.2800 0.0876 0.0967 0.0932 0.1046 0.0934 0.0946 0.0943 0.0791 0.0879 0.0869 0.0792 0.0804 0.0828 0.1417 0.1523 0.1314 0.1503 0.1587 0.1321 0.0971 0.0977 0.0643 0.0639 0.0833 0.0831 0.0940
va: 1.1025 1.1005 1.1148 1.1116 1.1014 1.1180 2.0635 2.1292 2.0609 2.7640 3.0303 3.9216 3.9214 3.8946 3.9169 3.8518 3.9657 3.9869 3.9050 3.9550 3.9275 4.0570 3.8919 4.0260 3.9288 4.0296 3.7562 3.9822 4.1164 3.6303 3.8348 4.4279 4.4260 3.9125 3.9496 1.0057 1.0121 1.0335 1.0097 1.0165 1.0305 0.9971 1.0135 1.0126 1.0133 1.0139 1.0023 1.0086 1.0103 1.0028 1.0318 1.0095 1.0036 1.0100 0.9882 0.9881 1.0114 1.0114 1.0008 1.0009 1.0033
dispcorr: -0.030571491 hartree
energy: -1864.697577953211
dipole: 15.53054 -15.33511 0.19543 5.21636 -5.11477 0.10159 -11.32793 11.26776 -0.06017
magnitude: 0.22833 au
magnitude: 0.58037 debye
