program: Orca
programVersion: 5.0.2
elementType: F F F F F F O O O N N C C C C C C C C C C C C C C C C C C C C C C C C H H H H H H H H H H H H H H H H H H H H H H H H H H
charge: 0
multiplicity: 1
keywords: wb97x-d3
keywords: def2-TZVPP
keywords: def2/J RIJCOSX
keywords: DEFGRID2
keywords: scfconv7
keywords: smallprint printgap noloewdin
keywords: NOSOSCF
formula: C24H26F6N2O3
InChI: InChI=1/C24H26F6N2O3/c1-2-10-33-21-11-15(23(25,26)27)6-8-20(21)34-19-12-17-4-3-5-18(13-19)32(17)35-22-9-7-16(14-31-22)24(28,29)30/h6-9,11,14,17-19H,2-5,10,12-13H2,1H3
61 atoms
F  7.423061 0.067896 2.230838
F  7.164422 -1.921037 1.451124
F  7.97178 -0.379879 0.198185
F  -7.363437 -2.588542 0.873189
F  -8.533586 -0.962353 0.089404
F  -7.390618 -2.209148 -1.240725
O  1.898107 0.517233 -0.754101
O  -3.142528 1.901767 0.610034
O  3.259343 -1.30127 -1.875582
N  -1.847001 1.472011 0.255239
N  -5.289932 1.399892 0.749652
C  -1.000863 1.527254 1.447944
C  -1.339801 2.360599 -0.791166
C  0.312261 0.843879 1.056856
C  -0.04579 1.715112 -1.286748
C  0.972226 1.443297 -0.184782
C  -0.868248 2.942506 2.018321
C  -1.221403 3.816801 -0.333025
C  -0.455119 3.984656 0.979307
C  3.109476 0.321799 -0.217649
C  -4.09018 0.96973 0.415905
C  3.87111 -0.688547 -0.850811
C  3.650333 1.010317 0.852628
C  -3.843254 -0.311959 -0.081526
C  5.143192 -0.971686 -0.398019
C  4.934109 0.717481 1.308009
C  5.673669 -0.268592 0.689401
C  -4.924276 -1.149771 -0.234618
C  -6.322176 0.584472 0.598808
C  -6.19929 -0.702688 0.103761
C  3.95225 -2.3076 -2.59978
C  7.049902 -0.617783 1.145906
C  -7.371631 -1.607631 -0.04277
C  3.01996 -2.84662 -3.663056
C  1.775566 -3.520324 -3.103404
H  -1.466606 0.891281 2.205329
H  -2.047469 2.317201 -1.623195
H  0.091496 -0.206405 0.846868
H  0.988946 0.861954 1.913237
H  0.396872 2.341599 -2.063676
H  -0.307882 0.760779 -1.752235
H  1.503608 2.365159 0.061869
H  -0.15627 2.927006 2.846678
H  -1.828651 3.228678 2.45475
H  -2.228992 4.224736 -0.218762
H  -0.751191 4.401267 -1.12712
H  0.620411 3.938056 0.800838
H  -0.638302 4.984741 1.378029
H  3.090961 1.786695 1.356006
H  -2.848466 -0.637701 -0.339896
H  5.732232 -1.740835 -0.88063
H  5.322665 1.274649 2.148754
H  -4.76427 -2.149665 -0.618455
H  -7.284718 0.988981 0.887545
H  4.265138 -3.11441 -1.926605
H  4.853561 -1.886141 -3.058944
H  2.74167 -2.039854 -4.346444
H  3.593784 -3.564244 -4.254527
H  2.037116 -4.350853 -2.444743
H  1.154712 -2.827577 -2.534525
H  1.158664 -3.922908 -3.9076
elementType: F O N C H
totalener: -1864.68087038 hartree
nucrepener: 3767.85454952 hartree
electener: -5632.53541990 hartree
twoeener: 4421.51431672 hartree
cpcmener: -0.03061944 hartree
kineticenergy: 1857.37399174 hartree
xcener: -168.788928020698 hartree
chargesum: 0.0000000
charge: -0.183369 -0.189415 -0.188801 -0.183034 -0.180801 -0.184213 -0.322768 -0.286746 -0.323768 -0.036462 -0.366674 0.142127 0.106407 -0.253457 -0.235305 0.169999 -0.203894 -0.190576 -0.138397 0.263180 0.373645 0.143117 -0.182320 -0.207083 -0.176929 -0.206539 -0.104206 -0.144301 0.010676 -0.070396 0.005533 0.557631 0.556502 -0.115738 -0.254388 0.085783 0.083325 0.097580 0.099965 0.092435 0.097460 0.100387 0.077331 0.090200 0.088263 0.077196 0.077452 0.080731 0.139155 0.154005 0.129497 0.149659 0.155831 0.133375 0.099094 0.112796 0.064252 0.066965 0.077456 0.079275 0.091293
qa: -0.1834 -0.1894 -0.1888 -0.1830 -0.1808 -0.1842 -0.3228 -0.2867 -0.3238 -0.0365 -0.3667 0.1421 0.1064 -0.2535 -0.2353 0.1700 -0.2039 -0.1906 -0.1384 0.2632 0.3736 0.1431 -0.1823 -0.2071 -0.1769 -0.2065 -0.1042 -0.1443 0.0107 -0.0704 0.0055 0.5576 0.5565 -0.1157 -0.2544 0.0858 0.0833 0.0976 0.1000 0.0924 0.0975 0.1004 0.0773 0.0902 0.0883 0.0772 0.0775 0.0807 0.1392 0.1540 0.1295 0.1497 0.1558 0.1334 0.0991 0.1128 0.0643 0.0670 0.0775 0.0793 0.0913
va: 1.1168 1.1035 1.1024 1.1052 1.1218 1.1114 2.0831 2.1028 2.0792 2.7731 3.0428 3.9444 3.9644 3.9213 3.9993 3.8188 3.9412 3.9409 3.9289 3.9606 4.0646 4.0467 3.9017 3.9407 3.9327 4.0221 3.7698 4.0378 4.0976 3.6292 3.8381 4.4293 4.4285 3.9418 3.9166 1.0051 1.0085 1.0248 1.0126 1.0168 1.0235 0.9938 1.0164 1.0152 1.0162 1.0163 1.0036 1.0088 1.0088 1.0261 1.0307 1.0091 1.0088 1.0136 0.9870 0.9926 1.0140 1.0110 1.0031 1.0129 1.0048
dispcorr: -0.031271383 hartree
energy: -1864.712141761644
dipole: 13.03104 -12.33608 0.69496 17.46174 -17.06663 0.39511 -16.59915 15.88394 -0.71521
magnitude: 1.07266 au
magnitude: 2.72649 debye
