program: Orca
programVersion: 5.0.2
elementType: F F F F F F O O O N N C C C C C C C C C C C C C C C C C C C C C C C C H H H H H H H H H H H H H H H H H H H H H H H H H H
charge: 0
multiplicity: 1
keywords: wb97x-d3
keywords: def2-TZVPP
keywords: def2/J RIJCOSX
keywords: DEFGRID2
keywords: scfconv7
keywords: smallprint printgap noloewdin
keywords: NOSOSCF
formula: C24H26F6N2O3
InChI: InChI=1/C24H26F6N2O3/c1-2-10-33-21-11-15(23(25,26)27)6-8-20(21)34-19-12-17-4-3-5-18(13-19)32(17)35-22-9-7-16(14-31-22)24(28,29)30/h6-9,11,14,17-19H,2-5,10,12-13H2,1H3
61 atoms
F  6.741613 -2.199262 1.304671
F  7.83951 -0.636418 0.326622
F  7.105152 -0.342481 2.325411
F  -7.380164 -2.243819 -1.16467
F  -6.984953 -2.880602 0.846951
F  -8.382764 -1.284036 0.483481
O  1.922926 0.896167 -1.023825
O  -3.161167 1.960175 0.517503
O  3.279648 -0.842437 -2.288593
N  -1.858902 1.601575 0.107371
N  -5.274837 1.349951 0.739592
C  -1.002815 1.524392 1.293161
C  -1.374959 2.629599 -0.816275
C  0.325924 0.931519 0.815593
C  -0.065387 2.085972 -1.391436
C  0.966372 1.705448 -0.335907
C  -0.896782 2.856432 2.041028
C  -1.285324 4.017523 -0.175959
C  -0.514808 4.032891 1.143917
C  3.087272 0.564033 -0.447487
C  -4.067445 0.979094 0.365105
C  3.830552 -0.422177 -1.137025
C  3.596887 1.105862 0.719209
C  -3.772841 -0.295379 -0.125639
C  5.030898 -0.861971 -0.613755
C  4.808827 0.659938 1.239151
C  5.515724 -0.328036 0.584732
C  -4.811665 -1.193497 -0.215019
C  -6.266721 0.475541 0.649444
C  -6.093955 -0.814837 0.179058
C  3.793829 -1.989158 -2.956223
C  6.793818 -0.867373 1.13646
C  -7.212364 -1.795257 0.089654
C  3.450207 -3.294178 -2.26127
C  1.960392 -3.476121 -2.016183
H  -1.445203 0.784599 1.965679
H  -2.082696 2.677783 -1.647498
H  0.135498 -0.090404 0.47451
H  0.999442 0.860119 1.671258
H  0.354879 2.818168 -2.084034
H  -0.305292 1.192217 -1.974103
H  1.468363 2.603053 0.032036
H  -0.177041 2.748482 2.8559
H  -1.858257 3.062058 2.518581
H  -2.300712 4.38666 -0.007079
H  -0.832735 4.708747 -0.891426
H  0.560289 4.035003 0.957128
H  -0.716123 4.968998 1.669224
H  3.059823 1.876246 1.255152
H  -2.774612 -0.571375 -0.425761
H  5.597862 -1.626486 -1.129149
H  5.164892 1.096501 2.161593
H  -4.612782 -2.189442 -0.591621
H  -7.237432 0.834612 0.969354
H  4.87299 -1.896987 -3.117319
H  3.32396 -1.961167 -3.940671
H  3.820782 -4.094725 -2.908021
H  3.998034 -3.392121 -1.320684
H  1.567269 -2.741041 -1.312021
H  1.387864 -3.386363 -2.942089
H  1.755672 -4.462712 -1.59841
elementType: F O N C H
totalener: -1864.67848315 hartree
nucrepener: 3796.75026946 hartree
electener: -5661.42875261 hartree
twoeener: 4450.35708931 hartree
cpcmener: -0.03131645 hartree
kineticenergy: 1857.32737940 hartree
xcener: -168.782293147704 hartree
chargesum: 0.0000000
charge: -0.189390 -0.188781 -0.183597 -0.184225 -0.184032 -0.180517 -0.326115 -0.285954 -0.335579 -0.037203 -0.366069 0.141769 0.102158 -0.259394 -0.233622 0.169521 -0.206168 -0.189390 -0.139937 0.277478 0.375911 0.110379 -0.196398 -0.212005 -0.176156 -0.188184 -0.101321 -0.142372 0.012741 -0.072006 0.005207 0.558923 0.557500 -0.118851 -0.261110 0.090660 0.082202 0.102892 0.103075 0.092274 0.093163 0.101761 0.078337 0.091226 0.087811 0.077575 0.077918 0.080299 0.141632 0.153495 0.132756 0.149162 0.155733 0.133142 0.103389 0.113567 0.076606 0.074550 0.078688 0.081891 0.092986
qa: -0.1894 -0.1888 -0.1836 -0.1842 -0.1840 -0.1805 -0.3261 -0.2860 -0.3356 -0.0372 -0.3661 0.1418 0.1022 -0.2594 -0.2336 0.1695 -0.2062 -0.1894 -0.1399 0.2775 0.3759 0.1104 -0.1964 -0.2120 -0.1762 -0.1882 -0.1013 -0.1424 0.0127 -0.0720 0.0052 0.5589 0.5575 -0.1189 -0.2611 0.0907 0.0822 0.1029 0.1031 0.0923 0.0932 0.1018 0.0783 0.0912 0.0878 0.0776 0.0779 0.0803 0.1416 0.1535 0.1328 0.1492 0.1557 0.1331 0.1034 0.1136 0.0766 0.0745 0.0787 0.0819 0.0930
va: 1.1031 1.1034 1.1162 1.1086 1.1079 1.1234 2.0827 2.1045 2.0555 2.7713 3.0423 3.9348 3.9775 3.9308 3.9902 3.8206 3.9452 3.9389 3.9300 3.9348 4.0650 4.0428 3.9103 3.9413 3.9230 4.0010 3.7369 4.0397 4.0908 3.6325 3.8780 4.4293 4.4283 3.8663 3.9318 1.0014 1.0101 1.0214 1.0117 1.0164 1.0276 0.9935 1.0162 1.0147 1.0165 1.0161 1.0036 1.0089 1.0071 1.0256 1.0236 1.0087 1.0088 1.0132 0.9979 0.9920 1.0140 1.0064 1.0077 1.0014 1.0052
dispcorr: -0.032268717 hartree
energy: -1864.710751866957
dipole: 13.99993 -13.28732 0.71260 20.31364 -19.92688 0.38676 -12.98080 12.42787 -0.55294
magnitude: 0.98139 au
magnitude: 2.49450 debye
