program: Orca
programVersion: 5.0.2
elementType: F F F F F F O O O N N C C C C C C C C C C C C C C C C C C C C C C C C H H H H H H H H H H H H H H H H H H H H H H H H H H
charge: 0
multiplicity: 1
keywords: wb97x-d3
keywords: def2-TZVPP
keywords: def2/J RIJCOSX
keywords: DEFGRID2
keywords: scfconv7
keywords: smallprint printgap noloewdin
keywords: NOSOSCF
formula: C24H26F6N2O3
InChI: InChI=1/C24H26F6N2O3/c1-2-10-33-21-11-15(23(25,26)27)6-8-20(21)34-19-12-17-4-3-5-18(13-19)32(17)35-22-9-7-16(14-31-22)24(28,29)30/h6-9,11,14,17-19H,2-5,10,12-13H2,1H3
61 atoms
F  7.648911 -0.962971 0.151092
F  6.641976 -2.854845 0.025217
F  7.134138 -1.780446 -1.773188
F  -7.216716 -2.384573 1.826267
F  -7.466959 -0.468482 2.757652
F  -8.577468 -0.951124 0.976149
O  1.761273 0.998727 -0.021512
O  -3.377624 0.9322 -1.683747
O  3.152191 0.566888 2.062121
N  -2.050815 0.911432 -1.206449
N  -5.501788 0.467656 -1.280648
C  -1.490974 2.255639 -1.352618
C  -1.285159 -0.061952 -1.988739
C  -0.158894 2.229089 -0.600321
C  0.060971 -0.199436 -1.273104
C  0.789586 1.127621 -1.061523
C  -1.419777 2.719853 -2.81072
C  -1.209818 0.292235 -3.476448
C  -0.73169 1.719193 -3.737552
C  2.913965 0.349047 -0.240479
C  -4.271706 0.438931 -0.809962
C  3.700137 0.132495 0.91455
C  3.374237 -0.093654 -1.468295
C  -3.944164 -0.058908 0.453443
C  4.922374 -0.498595 0.79818
C  4.605747 -0.733049 -1.578057
C  5.377341 -0.928967 -0.451605
C  -4.972237 -0.548845 1.226149
C  -6.483423 -0.005377 -0.52687
C  -6.27663 -0.531401 0.736801
C  3.886617 0.495469 3.277769
C  6.693778 -1.626561 -0.519484
C  -7.38557 -1.07911 1.565882
C  4.923402 1.596375 3.415144
C  5.613426 1.523587 4.769249
H  -2.143356 2.93985 -0.804502
H  -1.788355 -1.027319 -1.88793
H  -0.379774 2.074498 0.459341
H  0.325321 3.203731 -0.689286
H  0.682178 -0.908011 -1.824317
H  -0.127696 -0.639706 -0.289839
H  1.29553 1.444764 -1.975314
H  -0.91843 3.689453 -2.85115
H  -2.438725 2.895476 -3.165777
H  -2.203218 0.15959 -3.913378
H  -0.562474 -0.428918 -3.98093
H  0.352413 1.783825 -3.633862
H  -0.936266 1.986866 -4.776375
H  2.791735 0.052094 -2.367225
H  -2.92887 -0.064256 0.816204
H  5.532931 -0.665104 1.675828
H  4.933182 -1.060259 -2.554906
H  -4.748871 -0.94542 2.20903
H  -7.473597 0.044909 -0.963264
H  4.337983 -0.494854 3.404081
H  3.134148 0.598776 4.061368
H  5.670091 1.527682 2.620177
H  4.430078 2.56479 3.299984
H  6.339642 2.328975 4.879717
H  4.89817 1.612211 5.589129
H  6.148133 0.580638 4.897785
elementType: F O N C H
totalener: -1864.67887426 hartree
nucrepener: 3753.26985152 hartree
electener: -5617.94872578 hartree
twoeener: 4406.88450080 hartree
cpcmener: -0.03107454 hartree
kineticenergy: 1857.35299725 hartree
xcener: -168.786946876795 hartree
chargesum: 0.0000000
charge: -0.189095 -0.187950 -0.183782 -0.183919 -0.184181 -0.180895 -0.323843 -0.285589 -0.331161 -0.039232 -0.365756 0.103904 0.146303 -0.229759 -0.253383 0.169148 -0.189472 -0.206552 -0.136943 0.252569 0.375747 0.138097 -0.181443 -0.210487 -0.177523 -0.209353 -0.092512 -0.146137 0.011919 -0.071743 0.010638 0.554072 0.558531 -0.102913 -0.275898 0.081821 0.089429 0.092815 0.091619 0.100348 0.098322 0.095855 0.077273 0.087687 0.090391 0.078416 0.076837 0.079779 0.141196 0.154153 0.132164 0.148250 0.156562 0.133688 0.091979 0.113812 0.075761 0.069096 0.093870 0.082935 0.084540
qa: -0.1891 -0.1880 -0.1838 -0.1839 -0.1842 -0.1809 -0.3238 -0.2856 -0.3312 -0.0392 -0.3658 0.1039 0.1463 -0.2298 -0.2534 0.1691 -0.1895 -0.2066 -0.1369 0.2526 0.3757 0.1381 -0.1814 -0.2105 -0.1775 -0.2094 -0.0925 -0.1461 0.0119 -0.0717 0.0106 0.5541 0.5585 -0.1029 -0.2759 0.0818 0.0894 0.0928 0.0916 0.1003 0.0983 0.0959 0.0773 0.0877 0.0904 0.0784 0.0768 0.0798 0.1412 0.1542 0.1322 0.1482 0.1566 0.1337 0.0920 0.1138 0.0758 0.0691 0.0939 0.0829 0.0845
va: 1.1061 1.1001 1.1158 1.1077 1.1092 1.1225 2.0909 2.1030 2.0748 2.7719 3.0426 3.9751 3.9281 3.9857 3.9169 3.8400 3.9404 3.9450 3.9302 3.9573 4.0656 4.0343 3.9018 3.9384 3.9118 4.0276 3.7366 4.0412 4.0909 3.6314 3.8825 4.4317 4.4284 3.8527 3.9446 1.0101 1.0021 1.0274 1.0160 1.0122 1.0251 0.9913 1.0163 1.0168 1.0150 1.0164 1.0027 1.0094 1.0072 1.0255 1.0252 1.0093 1.0084 1.0131 0.9944 0.9947 1.0089 1.0137 1.0023 1.0018 1.0014
dispcorr: -0.031417892 hartree
energy: -1864.710292155339
dipole: 24.58748 -23.69796 0.88951 30.33507 -29.46531 0.86976 -4.86757 4.90167 0.03410
magnitude: 1.24454 au
magnitude: 3.16337 debye
