program: Orca
programVersion: 5.0.2
elementType: F F F F F F O O O N N C C C C C C C C C C C C C C C C C C C C C C C C H H H H H H H H H H H H H H H H H H H H H H H H H H
charge: 0
multiplicity: 1
keywords: wb97x-d3
keywords: def2-TZVPP
keywords: def2/J RIJCOSX
keywords: DEFGRID2
keywords: scfconv7
keywords: smallprint printgap noloewdin
keywords: NOSOSCF
formula: C24H26F6N2O3
InChI: InChI=1/C24H26F6N2O3/c1-2-10-33-21-11-15(23(25,26)27)6-8-20(21)34-19-12-17-4-3-5-18(13-19)32(17)35-22-9-7-16(14-31-22)24(28,29)30/h6-9,11,14,17-19H,2-5,10,12-13H2,1H3
61 atoms
F  7.857669 -0.576549 0.048757
F  7.386907 -0.613968 2.146011
F  7.094839 -2.373662 0.943377
F  -8.728168 -0.964933 -0.201989
F  -7.742163 -1.064668 -2.111143
F  -7.513034 -2.668191 -0.704429
O  1.777015 0.507866 -0.501684
O  -3.238063 1.306314 1.37773
O  3.122024 -0.964273 -2.079242
N  -1.951788 1.032534 0.861442
N  -5.410592 0.902833 1.268205
C  -1.060624 0.749041 1.986531
C  -1.490096 2.202791 0.110965
C  0.241896 0.239507 1.36383
C  -0.209427 1.760351 -0.598861
C  0.851201 1.197224 0.340219
C  -0.907927 1.932793 2.947617
C  -1.364417 3.459289 0.976894
C  -0.549943 3.247285 2.253195
C  2.995273 0.171343 -0.053599
C  -4.219703 0.599425 0.792016
C  3.755131 -0.622442 -0.944045
C  3.542227 0.540926 1.162794
C  -4.015159 -0.348999 -0.213026
C  5.037531 -0.996558 -0.597406
C  4.835093 0.156472 1.507343
C  5.579368 -0.60524 0.630977
C  -5.126118 -0.979618 -0.725121
C  -6.472645 0.28719 0.769324
C  -6.391941 -0.662219 -0.235167
C  3.838922 -1.581804 -3.141334
C  6.971526 -1.036046 0.948554
C  -7.594215 -1.333335 -0.804653
C  4.722083 -0.613592 -3.906413
C  3.962893 0.583218 -4.459672
H  -1.490432 -0.091019 2.537426
H  -2.227041 2.39625 -0.673034
H  0.02352 -0.703665 0.854934
H  0.948279 0.013888 2.164694
H  0.196836 2.599798 -1.166631
H  -0.479143 0.983552 -1.319535
H  1.374741 2.017896 0.835014
H  -0.155814 1.681384 3.699093
H  -1.846386 2.056978 3.49417
H  -2.369525 3.798071 1.240694
H  -0.927414 4.25987 0.375624
H  0.518227 3.283912 2.033538
H  -0.731266 4.077983 2.938523
H  2.982259 1.141003 1.866548
H  -3.027791 -0.582678 -0.578089
H  5.627208 -1.601881 -1.273382
H  5.229189 0.467367 2.464635
H  -4.997474 -1.717491 -1.507413
H  -7.424687 0.576289 1.197842
H  3.063025 -1.973987 -3.800885
H  4.411104 -2.442281 -2.779851
H  5.555732 -0.274253 -3.286207
H  5.169457 -1.181615 -4.726656
H  3.544081 1.204502 -3.666888
H  4.620444 1.218218 -5.054136
H  3.139344 0.269176 -5.10436
elementType: F O N C H
totalener: -1864.67880527 hartree
nucrepener: 3767.83890772 hartree
electener: -5632.51771298 hartree
twoeener: 4421.51534535 hartree
cpcmener: -0.03112557 hartree
kineticenergy: 1857.34105077 hartree
xcener: -168.784728568402 hartree
chargesum: 0.0000000
charge: -0.189345 -0.183070 -0.189057 -0.180800 -0.184032 -0.184020 -0.323911 -0.284925 -0.335379 -0.039598 -0.366443 0.140138 0.109418 -0.250186 -0.231182 0.165955 -0.206182 -0.193274 -0.137380 0.287283 0.375597 0.106265 -0.187970 -0.212443 -0.175978 -0.201632 -0.101215 -0.143346 0.013004 -0.072746 0.006084 0.558390 0.558351 -0.116955 -0.261406 0.082486 0.089233 0.095880 0.100289 0.093671 0.095046 0.097533 0.077719 0.089738 0.089161 0.077576 0.078099 0.080538 0.141478 0.153762 0.131069 0.149025 0.156191 0.134044 0.113535 0.103050 0.074351 0.075166 0.080192 0.091929 0.081230
qa: -0.1893 -0.1831 -0.1891 -0.1808 -0.1840 -0.1840 -0.3239 -0.2849 -0.3354 -0.0396 -0.3664 0.1401 0.1094 -0.2502 -0.2312 0.1660 -0.2062 -0.1933 -0.1374 0.2873 0.3756 0.1063 -0.1880 -0.2124 -0.1760 -0.2016 -0.1012 -0.1433 0.0130 -0.0727 0.0061 0.5584 0.5584 -0.1170 -0.2614 0.0825 0.0892 0.0959 0.1003 0.0937 0.0950 0.0975 0.0777 0.0897 0.0892 0.0776 0.0781 0.0805 0.1415 0.1538 0.1311 0.1490 0.1562 0.1340 0.1135 0.1030 0.0744 0.0752 0.0802 0.0919 0.0812
va: 1.1030 1.1173 1.1035 1.1227 1.1074 1.1092 2.0881 2.1040 2.0595 2.7776 3.0418 3.9586 3.9491 3.9134 3.9857 3.8398 3.9419 3.9448 3.9291 3.9243 4.0653 4.0461 3.9183 3.9393 3.9224 4.0179 3.7361 4.0398 4.0893 3.6322 3.8788 4.4306 4.4287 3.8691 3.9285 1.0077 1.0042 1.0274 1.0120 1.0158 1.0261 0.9924 1.0158 1.0150 1.0155 1.0163 1.0023 1.0086 1.0077 1.0256 1.0259 1.0090 1.0084 1.0129 0.9923 0.9980 1.0064 1.0143 1.0102 1.0049 1.0016
dispcorr: -0.031973284 hartree
energy: -1864.710778551907
dipole: 21.08869 -20.25930 0.82939 27.61612 -26.94091 0.67521 -8.96452 8.36558 -0.59894
magnitude: 1.22578 au
magnitude: 3.11568 debye
