program: Orca
programVersion: 5.0.2
elementType: F F F F F F O O O N N C C C C C C C C C C C C C C C C C C C C C C C C H H H H H H H H H H H H H H H H H H H H H H H H H H
charge: 0
multiplicity: 1
keywords: wb97x-d3
keywords: def2-TZVPP
keywords: def2/J RIJCOSX
keywords: DEFGRID2
keywords: scfconv7
keywords: smallprint printgap noloewdin
keywords: NOSOSCF
formula: C24H26F6N2O3
InChI: InChI=1/C24H26F6N2O3/c1-2-10-33-21-11-15(23(25,26)27)6-8-20(21)34-19-12-17-4-3-5-18(13-19)32(17)35-22-9-7-16(14-31-22)24(28,29)30/h6-9,11,14,17-19H,2-5,10,12-13H2,1H3
61 atoms
F  7.819666 0.004527 0.061087
F  7.402262 -1.167939 1.815493
F  7.302205 -2.067783 -0.136514
F  -8.130782 -0.82663 -2.227443
F  -8.503993 -1.62819 -0.26813
F  -8.688404 0.482104 -0.611644
O  1.662578 0.596135 -0.109182
O  -2.561594 -0.052058 0.239217
O  3.1565 0.373446 -2.154084
N  -2.189287 0.478571 1.495372
N  -4.210741 -0.630018 -1.119066
C  -1.229028 -0.432248 2.114139
C  -1.595536 1.799395 1.289426
C  0.071596 -0.574234 1.308548
C  -0.324711 1.752073 0.431655
C  0.711715 0.762954 0.945866
C  -1.054601 0.061799 3.553273
C  -1.429495 2.407836 2.684852
C  -0.642365 1.529015 3.655759
C  2.914329 0.193008 0.15245
C  -3.891257 -0.137614 0.061168
C  3.751707 0.088163 -0.983548
C  3.42882 -0.106221 1.402488
C  -4.838756 0.255452 1.008773
C  5.069147 -0.292977 -0.826681
C  4.760945 -0.484139 1.553555
C  5.576696 -0.574646 0.445653
C  -6.166726 0.109806 0.676613
C  -5.491945 -0.764995 -1.427658
C  -6.517698 -0.408564 -0.567862
C  3.906015 0.332235 -3.361565
C  7.01565 -0.951907 0.554759
C  -7.952901 -0.59468 -0.923906
C  4.773965 1.560727 -3.574517
C  5.541967 1.454278 -4.88379
H  -1.69719 -1.418021 2.164107
H  -2.331136 2.409875 0.75951
H  -0.145323 -1.111458 0.380928
H  0.76451 -1.201955 1.87379
H  0.106369 2.754391 0.376578
H  -0.60057 1.473494 -0.589208
H  1.225862 1.194022 1.806206
H  -0.331019 -0.576988 4.063793
H  -2.010237 -0.079646 4.064497
H  -2.431934 2.576541 3.086843
H  -0.964101 3.391143 2.591492
H  0.430065 1.638639 3.491071
H  -0.81296 1.879786 4.675831
H  2.811537 -0.048321 2.28808
H  -4.54869 0.656223 1.966713
H  5.719224 -0.372827 -1.687934
H  5.1282 -0.6992 2.547203
H  -6.92241 0.404915 1.393562
H  -5.695743 -1.176442 -2.409082
H  3.156002 0.271304 -4.151788
H  4.498728 -0.587667 -3.418752
H  4.138545 2.449692 -3.583602
H  5.478526 1.686753 -2.748865
H  6.211188 0.591809 -4.885542
H  4.869549 1.35227 -5.737577
H  6.152136 2.341768 -5.051943
elementType: F O N C H
totalener: -1864.67998197 hartree
nucrepener: 3749.96344647 hartree
electener: -5614.64342844 hartree
twoeener: 4404.07350697 hartree
cpcmener: -0.03226932 hartree
kineticenergy: 1857.33399765 hartree
xcener: -168.783306112751 hartree
chargesum: -0.0000000
charge: -0.189268 -0.183364 -0.189530 -0.180723 -0.182783 -0.184396 -0.320931 -0.273140 -0.330582 -0.062820 -0.366108 0.162706 0.116305 -0.235837 -0.201454 0.131888 -0.223398 -0.211663 -0.122247 0.277164 0.371330 0.124803 -0.184000 -0.210236 -0.176961 -0.210126 -0.107182 -0.142029 0.011437 -0.070302 0.008924 0.557596 0.555428 -0.108462 -0.276189 0.082904 0.091787 0.093424 0.100365 0.091062 0.094655 0.088855 0.079657 0.090248 0.091217 0.079628 0.080682 0.083824 0.136380 0.152381 0.133189 0.148981 0.155035 0.133967 0.114826 0.092756 0.071395 0.077231 0.084646 0.083727 0.093327
qa: -0.1893 -0.1834 -0.1895 -0.1807 -0.1828 -0.1844 -0.3209 -0.2731 -0.3306 -0.0628 -0.3661 0.1627 0.1163 -0.2358 -0.2015 0.1319 -0.2234 -0.2117 -0.1222 0.2772 0.3713 0.1248 -0.1840 -0.2102 -0.1770 -0.2101 -0.1072 -0.1420 0.0114 -0.0703 0.0089 0.5576 0.5554 -0.1085 -0.2762 0.0829 0.0918 0.0934 0.1004 0.0911 0.0947 0.0889 0.0797 0.0902 0.0912 0.0796 0.0807 0.0838 0.1364 0.1524 0.1332 0.1490 0.1550 0.1340 0.1148 0.0928 0.0714 0.0772 0.0846 0.0837 0.0933
va: 1.1027 1.1167 1.1029 1.1217 1.1047 1.1116 2.0837 2.1122 2.0765 2.7920 3.0433 3.9330 3.9320 3.8982 3.9408 3.8804 3.9632 3.9779 3.9038 3.9639 4.0662 4.0444 3.9043 3.9373 3.9021 4.0249 3.7562 4.0349 4.0957 3.6288 3.8786 4.4324 4.4276 3.8486 3.9450 1.0064 1.0031 1.0339 1.0129 1.0179 1.0326 0.9971 1.0142 1.0108 1.0088 1.0148 1.0020 1.0089 1.0117 1.0261 1.0255 1.0089 1.0089 1.0130 0.9948 0.9948 1.0131 1.0089 1.0012 1.0017 1.0028
dispcorr: -0.031404094 hartree
energy: -1864.711386061609
dipole: 23.70306 -23.90171 -0.19865 22.75344 -21.44279 1.31065 3.78844 -2.12211 1.66633
magnitude: 2.12930 au
magnitude: 5.41224 debye
