program: Orca
programVersion: 5.0.2
elementType: F F F F F F O O O N N C C C C C C C C C C C C C C C C C C C C C C C C H H H H H H H H H H H H H H H H H H H H H H H H H H
charge: 0
multiplicity: 1
keywords: wb97x-d3
keywords: def2-TZVPP
keywords: def2/J RIJCOSX
keywords: DEFGRID2
keywords: scfconv7
keywords: smallprint printgap noloewdin
keywords: NOSOSCF
formula: C24H26F6N2O3
InChI: InChI=1/C24H26F6N2O3/c1-2-10-33-21-11-15(23(25,26)27)6-8-20(21)34-19-12-17-4-3-5-18(13-19)32(17)35-22-9-7-16(14-31-22)24(28,29)30/h6-9,11,14,17-19H,2-5,10,12-13H2,1H3
61 atoms
F  6.50823 -2.64574 -1.782702
F  7.442604 -1.441985 -0.264068
F  6.230948 -3.122766 0.296305
F  -7.654651 -0.905145 2.117369
F  -7.688264 -1.715074 0.120714
F  -6.53991 -2.680966 1.66091
O  1.827167 1.227194 -0.115225
O  -2.350778 1.378954 -0.114645
O  3.266293 0.782148 1.933538
N  -2.081566 1.641811 -1.48283
N  -4.262365 0.292209 -0.813761
C  -1.250694 2.84537 -1.495828
C  -1.345589 0.509481 -2.050912
C  0.066778 2.671956 -0.725725
C  -0.036231 0.218382 -1.308899
C  0.861173 1.443079 -1.147686
C  -1.097783 3.248368 -2.964249
C  -1.202225 0.797388 -3.547001
C  -0.544141 2.139307 -3.855944
C  2.876576 0.420556 -0.329316
C  -3.491658 0.73775 0.15077
C  3.675914 0.173983 0.810744
C  3.225365 -0.155638 -1.537832
C  -3.768441 0.556257 1.513143
C  4.783579 -0.642254 0.707872
C  4.34448 -0.978463 -1.636724
C  5.115751 -1.223541 -0.520671
C  -4.892585 -0.153472 1.845721
C  -5.354468 -0.389191 -0.479081
C  -5.712223 -0.652341 0.828032
C  3.960394 0.547482 3.14948
C  6.316571 -2.104941 -0.576152
C  -6.898444 -1.482154 1.173115
C  3.232104 1.290341 4.248705
C  1.799737 0.819717 4.454593
H  -1.819079 3.638233 -1.003981
H  -1.978146 -0.375561 -1.959691
H  -0.156394 2.593117 0.341659
H  0.672306 3.572705 -0.849553
H  0.483818 -0.588248 -1.829747
H  -0.272475 -0.16483 -0.312106
H  1.394737 1.657556 -2.075713
H  -0.468749 4.139049 -3.021382
H  -2.085526 3.542119 -3.328546
H  -2.205045 0.779328 -3.981657
H  -0.647375 -0.020258 -4.011545
H  0.539634 2.069005 -3.756213
H  -0.720058 2.396631 -4.902643
H  2.636469 0.016193 -2.42771
H  -3.109055 0.958708 2.270157
H  5.396606 -0.836033 1.578761
H  4.58165 -1.414721 -2.59688
H  -5.129304 -0.31882 2.889317
H  -5.956466 -0.738799 -1.30895
H  4.995311 0.89884 3.06951
H  3.98846 -0.52659 3.369138
H  3.806157 1.14745 5.167387
H  3.2535 2.363099 4.037945
H  1.182966 0.98951 3.571384
H  1.762224 -0.246783 4.685779
H  1.331547 1.351575 5.283597
elementType: F O N C H
totalener: -1864.68051355 hartree
nucrepener: 3817.48372262 hartree
electener: -5682.16423618 hartree
twoeener: 4471.94008695 hartree
cpcmener: -0.03035003 hartree
kineticenergy: 1857.37031341 hartree
xcener: -168.788892439073 hartree
chargesum: 0.0000000
charge: -0.183394 -0.189171 -0.189432 -0.184275 -0.181115 -0.183469 -0.328006 -0.288030 -0.323659 -0.025842 -0.371279 0.101396 0.135663 -0.206456 -0.255639 0.134247 -0.202548 -0.220873 -0.123751 0.268090 0.424943 0.138470 -0.185726 -0.253408 -0.177089 -0.210720 -0.102232 -0.094205 0.005789 -0.096446 0.003792 0.558376 0.553776 -0.115664 -0.253273 0.088057 0.096520 0.096231 0.092733 0.106769 0.099210 0.098752 0.076442 0.087176 0.089938 0.078565 0.079056 0.082322 0.139994 0.149632 0.129533 0.149806 0.157523 0.131992 0.111368 0.101476 0.066969 0.064479 0.078251 0.077828 0.090537
qa: -0.1834 -0.1892 -0.1894 -0.1843 -0.1811 -0.1835 -0.3280 -0.2880 -0.3237 -0.0258 -0.3713 0.1014 0.1357 -0.2065 -0.2556 0.1342 -0.2025 -0.2209 -0.1238 0.2681 0.4249 0.1385 -0.1857 -0.2534 -0.1771 -0.2107 -0.1022 -0.0942 0.0058 -0.0964 0.0038 0.5584 0.5538 -0.1157 -0.2533 0.0881 0.0965 0.0962 0.0927 0.1068 0.0992 0.0988 0.0764 0.0872 0.0899 0.0786 0.0791 0.0823 0.1400 0.1496 0.1295 0.1498 0.1575 0.1320 0.1114 0.1015 0.0670 0.0645 0.0783 0.0778 0.0905
va: 1.1169 1.1024 1.1031 1.1113 1.1216 1.1038 2.0767 2.1363 2.0784 2.7664 3.0323 3.9739 3.8818 3.9505 3.8914 3.8330 3.9654 3.9847 3.9046 3.9608 3.9463 4.0554 3.8917 4.0276 3.9321 4.0206 3.7656 3.9906 4.1053 3.6353 3.8400 4.4292 4.4299 3.9412 3.9168 1.0078 1.0080 1.0287 1.0162 1.0107 1.0286 0.9952 1.0140 1.0138 1.0132 1.0139 1.0039 1.0093 1.0086 1.0039 1.0304 1.0091 1.0044 1.0089 0.9914 0.9876 1.0114 1.0138 1.0144 1.0030 1.0048
dispcorr: -0.031301061 hartree
energy: -1864.711814614647
dipole: 12.71330 -12.52290 0.19040 36.93119 -35.57192 1.35927 -2.83324 2.91330 0.08006
magnitude: 1.37487 au
magnitude: 3.49465 debye
