program: Orca
programVersion: 5.0.2
elementType: F F F F F F O O O N N C C C C C C C C C C C C C C C C C C C C C C C C H H H H H H H H H H H H H H H H H H H H H H H H H H
charge: 0
multiplicity: 1
keywords: wb97x-d3
keywords: def2-TZVPP
keywords: def2/J RIJCOSX
keywords: DEFGRID2
keywords: scfconv7
keywords: smallprint printgap noloewdin
keywords: NOSOSCF
formula: C24H26F6N2O3
InChI: InChI=1/C24H26F6N2O3/c1-2-10-33-21-11-15(23(25,26)27)6-8-20(21)34-19-12-17-4-3-5-18(13-19)32(17)35-22-9-7-16(14-31-22)24(28,29)30/h6-9,11,14,17-19H,2-5,10,12-13H2,1H3
61 atoms
F  6.615265 -2.866956 0.346702
F  6.615029 -2.638373 -1.791068
F  7.588185 -1.177283 -0.548211
F  -7.186957 -2.557981 1.528143
F  -7.982341 -0.683598 2.216044
F  -8.227158 -1.267929 0.160788
O  1.761675 0.987677 -0.069648
O  -2.492596 1.043323 -0.055717
O  3.435328 0.925683 1.854364
N  -2.189465 1.273787 -1.421224
N  -4.464087 0.073988 -0.774329
C  -1.37664 2.489015 -1.462159
C  -1.429133 0.135494 -1.939476
C  -0.056837 2.359755 -0.686986
C  -0.118821 -0.104787 -1.176807
C  0.761544 1.138113 -1.082565
C  -1.226982 2.851693 -2.941882
C  -1.281165 0.373912 -3.444651
C  -0.661744 1.723399 -3.803251
C  2.865322 0.264427 -0.304608
C  -3.694169 0.510721 0.195709
C  3.792849 0.228813 0.763378
C  3.157855 -0.415571 -1.473835
C  -4.037833 0.431984 1.55142
C  4.964337 -0.489694 0.630987
C  4.338773 -1.142866 -1.599736
C  5.23435 -1.186216 -0.552287
C  -5.243614 -0.136466 1.873787
C  -5.633696 -0.470237 -0.450478
C  -6.075613 -0.603109 0.852191
C  4.322866 0.977352 2.96183
C  6.503948 -1.964785 -0.64217
C  -7.365739 -1.272568 1.182348
C  3.674728 1.811734 4.045702
C  4.570959 1.913505 5.270245
H  -1.958526 3.286426 -0.994117
H  -2.0472 -0.756775 -1.819536
H  -0.279926 2.298741 0.381823
H  0.529551 3.270298 -0.830459
H  0.408678 -0.934378 -1.651623
H  -0.355716 -0.434761 -0.161298
H  1.268574 1.328166 -2.030696
H  -0.605525 3.74578 -3.02478
H  -2.217168 3.126591 -3.313654
H  -2.280333 0.310033 -3.883055
H  -0.699353 -0.44245 -3.877637
H  0.424731 1.683086 -3.719351
H  -0.859212 1.941698 -4.854964
H  2.476691 -0.400957 -2.312793
H  -3.371076 0.809953 2.314403
H  5.676382 -0.518682 1.445716
H  4.525137 -1.666308 -2.52688
H  -5.533807 -0.212846 2.913631
H  -6.232382 -0.816331 -1.284923
H  5.279626 1.419564 2.659284
H  4.526907 -0.033877 3.333091
H  3.461613 2.811226 3.6581
H  2.716738 1.364662 4.32306
H  5.527904 2.380332 5.030097
H  4.100399 2.514895 6.048056
H  4.779821 0.931104 5.697668
elementType: F O N C H
totalener: -1864.68079837 hartree
nucrepener: 3762.28929748 hartree
electener: -5626.97009586 hartree
twoeener: 4416.70915835 hartree
cpcmener: -0.03074602 hartree
kineticenergy: 1857.32843724 hartree
xcener: -168.780795943403 hartree
chargesum: 0.0000000
charge: -0.189385 -0.183350 -0.188948 -0.182643 -0.183817 -0.181280 -0.321827 -0.292635 -0.320202 -0.026425 -0.369633 0.103967 0.148018 -0.204178 -0.257279 0.133556 -0.204875 -0.225198 -0.121808 0.273295 0.432214 0.138487 -0.187309 -0.258182 -0.183649 -0.212738 -0.105924 -0.086501 0.001275 -0.096284 0.026262 0.556475 0.551609 -0.092502 -0.278512 0.086955 0.092997 0.094698 0.092019 0.105663 0.096633 0.094426 0.076419 0.087629 0.090261 0.079001 0.079505 0.082378 0.138527 0.149219 0.128737 0.149334 0.156029 0.132035 0.096369 0.093663 0.064276 0.064122 0.082829 0.093547 0.082655
qa: -0.1894 -0.1833 -0.1889 -0.1826 -0.1838 -0.1813 -0.3218 -0.2926 -0.3202 -0.0264 -0.3696 0.1040 0.1480 -0.2042 -0.2573 0.1336 -0.2049 -0.2252 -0.1218 0.2733 0.4322 0.1385 -0.1873 -0.2582 -0.1836 -0.2127 -0.1059 -0.0865 0.0013 -0.0963 0.0263 0.5565 0.5516 -0.0925 -0.2785 0.0870 0.0930 0.0947 0.0920 0.1057 0.0966 0.0944 0.0764 0.0876 0.0903 0.0790 0.0795 0.0824 0.1385 0.1492 0.1287 0.1493 0.1560 0.1320 0.0964 0.0937 0.0643 0.0641 0.0828 0.0935 0.0827
va: 1.1036 1.1161 1.1021 1.1019 1.1135 1.1203 2.0861 2.1329 2.0820 2.7713 3.0336 3.9706 3.8832 3.9469 3.8848 3.8506 3.9666 3.9829 3.9028 3.9770 3.9290 4.0609 3.8927 4.0360 3.9224 4.0308 3.7772 3.9805 4.1212 3.6357 3.8434 4.4316 4.4292 3.9140 3.9483 1.0077 1.0079 1.0308 1.0169 1.0118 1.0315 0.9977 1.0140 1.0132 1.0127 1.0137 1.0027 1.0089 1.0106 1.0039 1.0327 1.0096 1.0049 1.0092 0.9882 0.9871 1.0115 1.0115 1.0009 1.0039 1.0010
dispcorr: -0.030503531 hartree
energy: -1864.711301903846
dipole: 20.74800 -20.54472 0.20328 35.98271 -34.64274 1.33997 -0.63078 0.73901 0.10823
magnitude: 1.35962 au
magnitude: 3.45587 debye
