program: Orca
programVersion: 5.0.2
elementType: F F F F F F O O O N N C C C C C C C C C C C C C C C C C C C C C C C C H H H H H H H H H H H H H H H H H H H H H H H H H H
charge: 0
multiplicity: 1
keywords: wb97x-d3
keywords: def2-TZVPP
keywords: def2/J RIJCOSX
keywords: DEFGRID2
keywords: scfconv7
keywords: smallprint printgap noloewdin
keywords: NOSOSCF
formula: C24H26F6N2O3
InChI: InChI=1/C24H26F6N2O3/c1-2-10-33-21-11-15(23(25,26)27)6-8-20(21)34-19-12-17-4-3-5-18(13-19)32(17)35-22-9-7-16(14-31-22)24(28,29)30/h6-9,11,14,17-19H,2-5,10,12-13H2,1H3
61 atoms
F  6.58069 -2.663459 -1.747259
F  7.545781 -1.262406 -0.430541
F  6.494682 -2.947925 0.380547
F  -7.868311 -0.888284 2.247345
F  -8.178054 -1.236294 0.14644
F  -7.080168 -2.659641 1.325723
O  1.767485 1.051024 -0.08997
O  -2.477581 1.117913 -0.065782
O  3.40486 0.943847 1.860199
N  -2.180782 1.338767 -1.433398
N  -4.420292 0.101964 -0.788201
C  -1.368016 2.552971 -1.486884
C  -1.425238 0.196029 -1.949742
C  -0.043446 2.427169 -0.719301
C  -0.113211 -0.042583 -1.19119
C  0.769608 1.198731 -1.105602
C  -1.230609 2.905394 -2.970017
C  -1.285477 0.426241 -3.456663
C  -0.666054 1.772683 -3.825042
C  2.857077 0.302398 -0.30969
C  -3.664486 0.554114 0.186178
C  3.764534 0.241056 0.77408
C  3.154349 -0.380101 -1.476307
C  -4.008594 0.461492 1.54023
C  4.920096 -0.505662 0.660296
C  4.320213 -1.134678 -1.584158
C  5.194904 -1.204185 -0.520616
C  -5.198975 -0.143201 1.857808
C  -5.573393 -0.475865 -0.469471
C  -6.013528 -0.628024 0.83189
C  4.267948 0.961801 2.987934
C  6.445059 -2.016425 -0.586209
C  -7.282786 -1.346345 1.134694
C  3.623883 1.81396 4.059701
C  4.492468 1.876988 5.306537
H  -1.946503 3.353313 -1.019493
H  -2.044071 -0.694524 -1.822594
H  -0.260859 2.378464 0.351288
H  0.54522 3.334169 -0.875415
H  0.411632 -0.875078 -1.663881
H  -0.347307 -0.367914 -0.173521
H  1.278553 1.379934 -2.054473
H  -0.615559 3.802575 -3.065128
H  -2.225574 3.170795 -3.336259
H  -2.287663 0.362319 -3.888374
H  -0.708379 -0.393718 -3.889093
H  0.420384 1.732715 -3.740659
H  -0.863585 1.984177 -4.87812
H  2.488715 -0.346055 -2.327132
H  -3.355248 0.85456 2.307168
H  5.615403 -0.554942 1.488364
H  4.509665 -1.658453 -2.510551
H  -5.48726 -0.232297 2.897027
H  -6.160766 -0.834749 -1.306661
H  5.245942 1.37228 2.709617
H  4.429004 -0.057398 3.358697
H  3.457223 2.822335 3.672314
H  2.643491 1.401237 4.310789
H  4.025013 2.49142 6.075921
H  4.654937 0.885531 5.733136
H  5.471422 2.309677 5.09254
elementType: F O N C H
totalener: -1864.68068830 hartree
nucrepener: 3767.92310016 hartree
electener: -5632.60378846 hartree
twoeener: 4422.35480123 hartree
cpcmener: -0.03066974 hartree
kineticenergy: 1857.34810286 hartree
xcener: -168.784637150979 hartree
chargesum: -0.0000000
charge: -0.183336 -0.189076 -0.189457 -0.182760 -0.182425 -0.182272 -0.322044 -0.292962 -0.319995 -0.023557 -0.369418 0.101246 0.144321 -0.205104 -0.256503 0.134203 -0.203243 -0.224683 -0.121722 0.268813 0.432426 0.141289 -0.185572 -0.257247 -0.184187 -0.212777 -0.106211 -0.085794 -0.001910 -0.095805 0.025969 0.557287 0.551785 -0.091933 -0.278830 0.087173 0.093977 0.094808 0.092170 0.105942 0.096892 0.094785 0.076418 0.087107 0.090063 0.078986 0.079215 0.082092 0.138921 0.149746 0.128524 0.149340 0.156056 0.131615 0.096023 0.093975 0.064398 0.064063 0.093662 0.082720 0.082810
qa: -0.1833 -0.1891 -0.1895 -0.1828 -0.1824 -0.1823 -0.3220 -0.2930 -0.3200 -0.0236 -0.3694 0.1012 0.1443 -0.2051 -0.2565 0.1342 -0.2032 -0.2247 -0.1217 0.2688 0.4324 0.1413 -0.1856 -0.2572 -0.1842 -0.2128 -0.1062 -0.0858 -0.0019 -0.0958 0.0260 0.5573 0.5518 -0.0919 -0.2788 0.0872 0.0940 0.0948 0.0922 0.1059 0.0969 0.0948 0.0764 0.0871 0.0901 0.0790 0.0792 0.0821 0.1389 0.1497 0.1285 0.1493 0.1561 0.1316 0.0960 0.0940 0.0644 0.0641 0.0937 0.0827 0.0828
va: 1.1163 1.1025 1.1029 1.1159 1.1177 1.1015 2.0862 2.1321 2.0819 2.7669 3.0319 3.9729 3.8814 3.9474 3.8854 3.8493 3.9659 3.9841 3.9032 3.9791 3.9274 4.0609 3.8901 4.0325 3.9242 4.0278 3.7755 3.9728 4.1290 3.6340 3.8442 4.4311 4.4289 3.9135 3.9480 1.0078 1.0080 1.0307 1.0167 1.0115 1.0311 0.9970 1.0140 1.0137 1.0128 1.0137 1.0029 1.0090 1.0101 1.0037 1.0330 1.0094 1.0047 1.0094 0.9881 0.9872 1.0115 1.0116 1.0038 1.0009 1.0009
dispcorr: -0.030543650 hartree
energy: -1864.711231949766
dipole: 20.29764 -20.11432 0.18332 36.98472 -35.61907 1.36565 -0.65019 0.76841 0.11822
magnitude: 1.38296 au
magnitude: 3.51521 debye
