program: Orca
programVersion: 5.0.2
elementType: F F F F F F O O O N N C C C C C C C C C C C C C C C C C C C C C C C C H H H H H H H H H H H H H H H H H H H H H H H H H H
charge: 0
multiplicity: 1
keywords: wb97x-d3
keywords: def2-TZVPP
keywords: def2/J RIJCOSX
keywords: DEFGRID2
keywords: scfconv7
keywords: smallprint printgap noloewdin
keywords: NOSOSCF
formula: C24H26F6N2O3
InChI: InChI=1/C24H26F6N2O3/c1-2-10-33-21-11-15(23(25,26)27)6-8-20(21)34-19-12-17-4-3-5-18(13-19)32(17)35-22-9-7-16(14-31-22)24(28,29)30/h6-9,11,14,17-19H,2-5,10,12-13H2,1H3
61 atoms
F  6.484216 -2.88883 -0.321598
F  7.516206 -1.165352 0.428903
F  6.562802 -2.524562 1.796467
F  -7.753681 -1.218531 -2.054606
F  -6.889705 -2.904001 -1.046225
F  -8.015767 -1.452857 0.070901
O  1.750036 1.12576 -0.008582
O  -2.429987 1.157562 0.018657
O  3.221528 0.655351 -2.039195
N  -2.155074 1.562292 1.35029
N  -4.357242 0.189892 0.841924
C  -1.389322 0.509367 2.019241
C  -1.359082 2.783834 1.245565
C  -0.075444 0.178955 1.300011
C  -0.034216 2.574746 0.498165
C  0.792546 1.403661 1.018657
C  -1.248701 0.945163 3.480261
C  -1.224224 3.329969 2.668583
C  -0.628366 2.329057 3.654678
C  2.839456 0.387482 0.244754
C  -3.591986 0.525393 -0.171604
C  3.652818 0.126708 -0.882339
C  3.220981 -0.106772 1.480186
C  -3.899103 0.229987 -1.506049
C  4.800805 -0.62603 -0.740247
C  4.382919 -0.862957 1.618066
C  5.164398 -1.128366 0.512805
C  -5.06331 -0.449312 -1.758604
C  -5.484974 -0.464248 0.584995
C  -5.889084 -0.809517 -0.690477
C  4.027069 0.501833 -3.198833
C  6.422127 -1.924717 0.611138
C  -7.134848 -1.589864 -0.92623
C  3.369719 1.242381 -4.34252
C  4.205848 1.134043 -5.608413
H  -2.001031 -0.395282 2.018276
H  -1.94788 3.508765 0.678531
H  -0.308209 -0.30244 0.346048
H  0.46514 -0.562138 1.892466
H  0.550305 3.496447 0.545762
H  -0.252891 2.401163 -0.558821
H  1.331987 1.708141 1.917916
H  -0.67052 0.19182 4.019258
H  -2.249551 0.942116 3.920149
H  -2.223401 3.616768 3.006946
H  -0.63053 4.246111 2.641072
H  0.456145 2.282295 3.547053
H  -0.802198 2.678172 4.674807
H  2.625217 0.082327 2.362163
H  -3.23577 0.530345 -2.305626
H  5.421925 -0.833156 -1.601448
H  4.645265 -1.232753 2.599483
H  -5.326396 -0.694446 -2.779443
H  -6.08341 -0.71829 1.451966
H  4.135407 -0.560579 -3.447388
H  5.030676 0.904116 -3.016199
H  2.371897 0.832998 -4.51925
H  3.242747 2.293359 -4.070852
H  4.333361 0.095096 -5.917948
H  3.734206 1.665899 -6.434604
H  5.200381 1.561702 -5.468665
elementType: F O N C H
totalener: -1864.68082625 hartree
nucrepener: 3776.09917524 hartree
electener: -5640.78000149 hartree
twoeener: 4430.54224905 hartree
cpcmener: -0.03074794 hartree
kineticenergy: 1857.35200883 hartree
xcener: -168.785135954137 hartree
chargesum: -0.0000000
charge: -0.189854 -0.188325 -0.183266 -0.183476 -0.182177 -0.181909 -0.321588 -0.291463 -0.321584 -0.022249 -0.370800 0.135401 0.098332 -0.249290 -0.197681 0.123990 -0.219676 -0.200077 -0.125203 0.252948 0.430033 0.152091 -0.180188 -0.254930 -0.181129 -0.214883 -0.100996 -0.086864 0.002090 -0.097560 0.027217 0.555043 0.551715 -0.091250 -0.278114 0.094147 0.086555 0.097151 0.106167 0.092100 0.093285 0.095397 0.078538 0.089790 0.086294 0.075845 0.080203 0.082804 0.139532 0.149549 0.127019 0.148471 0.155566 0.130874 0.094756 0.094228 0.064863 0.064003 0.082697 0.093322 0.082516
qa: -0.1899 -0.1883 -0.1833 -0.1835 -0.1822 -0.1819 -0.3216 -0.2915 -0.3216 -0.0222 -0.3708 0.1354 0.0983 -0.2493 -0.1977 0.1240 -0.2197 -0.2001 -0.1252 0.2529 0.4300 0.1521 -0.1802 -0.2549 -0.1811 -0.2149 -0.1010 -0.0869 0.0021 -0.0976 0.0272 0.5550 0.5517 -0.0912 -0.2781 0.0941 0.0866 0.0972 0.1062 0.0921 0.0933 0.0954 0.0785 0.0898 0.0863 0.0758 0.0802 0.0828 0.1395 0.1495 0.1270 0.1485 0.1556 0.1309 0.0948 0.0942 0.0649 0.0640 0.0827 0.0933 0.0825
va: 1.1047 1.1000 1.1164 1.1141 1.1023 1.1189 2.0849 2.1347 2.0815 2.7644 3.0326 3.8957 3.9790 3.8786 3.9438 3.8599 3.9812 3.9639 3.9050 3.9870 3.9330 4.0543 3.8888 4.0303 3.9184 4.0330 3.7661 3.9787 4.1226 3.6352 3.8437 4.4311 4.4293 3.9114 3.9474 1.0083 1.0082 1.0306 1.0109 1.0158 1.0321 0.9949 1.0139 1.0133 1.0146 1.0143 1.0032 1.0094 1.0089 1.0040 1.0349 1.0094 1.0051 1.0097 0.9865 0.9885 1.0113 1.0119 1.0010 1.0038 1.0011
dispcorr: -0.030550216 hartree
energy: -1864.711376469910
dipole: 18.73324 -18.52637 0.20687 37.65186 -36.29240 1.35946 -2.65809 2.46868 -0.18941
magnitude: 1.38809 au
magnitude: 3.52825 debye
