program: Orca
programVersion: 5.0.2
elementType: F F F F F F O O O N N C C C C C C C C C C C C C C C C C C C C C C C C H H H H H H H H H H H H H H H H H H H H H H H H H H
charge: 0
multiplicity: 1
keywords: wb97x-d3
keywords: def2-TZVPP
keywords: def2/J RIJCOSX
keywords: DEFGRID2
keywords: scfconv7
keywords: smallprint printgap noloewdin
keywords: NOSOSCF
formula: C24H26F6N2O3
InChI: InChI=1/C24H26F6N2O3/c1-2-10-33-21-11-15(23(25,26)27)6-8-20(21)34-19-12-17-4-3-5-18(13-19)32(17)35-22-9-7-16(14-31-22)24(28,29)30/h6-9,11,14,17-19H,2-5,10,12-13H2,1H3
61 atoms
F  7.414662 -1.903886 0.037044
F  7.503777 -1.038403 -1.93143
F  7.844926 0.185718 -0.196308
F  -7.84005 0.567122 2.457142
F  -8.457385 0.8430 0.41409
F  -8.366631 -1.134293 1.258806
O  1.666379 0.502432 -0.124286
O  -2.477822 -0.47097 -0.40663
O  3.155798 0.440213 1.941946
N  -2.163957 -0.005297 -1.706484
N  -4.596131 0.355127 -0.795235
C  -1.65587 1.36451 -1.618927
C  -1.141428 -0.900447 -2.242952
C  -0.392905 1.474945 -0.755951
C  0.16403 -0.885003 -1.43315
C  0.708417 0.518552 -1.185996
C  -1.522341 1.853974 -3.063877
C  -0.993599 -0.528706 -3.720571
C  -0.674246 0.94651 -3.953777
C  2.935637 0.14336 -0.357428
C  -3.762229 -0.333638 -0.052057
C  3.766772 0.129287 0.787307
C  3.474909 -0.189191 -1.58798
C  -4.123298 -0.939953 1.158318
C  5.10441 -0.184841 0.658689
C  4.825733 -0.505656 -1.711325
C  5.636494 -0.498503 -0.596659
C  -5.423933 -0.808691 1.574002
C  -5.855051 0.474147 -0.384387
C  -6.324839 -0.082983 0.787867
C  3.906131 0.398427 3.14757
C  7.090995 -0.814594 -0.679995
C  -7.743232 0.053361 1.221625
C  2.983396 0.742885 4.296219
C  3.724264 0.695067 5.624021
H  -2.430454 1.975047 -1.150112
H  -1.542393 -1.915932 -2.204882
H  -0.657908 1.265223 0.284239
H  -0.029344 2.504868 -0.782862
H  0.901458 -1.508123 -1.944962
H  -0.017373 -1.355781 -0.462713
H  1.192792 0.912673 -2.080445
H  -1.124374 2.870798 -3.060506
H  -2.532379 1.916792 -3.476793
H  -1.93603 -0.775904 -4.215774
H  -0.228909 -1.164147 -4.17248
H  0.38858 1.136854 -3.798276
H  -0.859432 1.194728 -5.001084
H  2.863899 -0.20637 -2.47957
H  -3.400125 -1.496604 1.73864
H  5.745273 -0.187896 1.530771
H  5.209878 -0.752112 -2.691202
H  -5.735672 -1.271781 2.501971
H  -6.502371 1.049859 -1.034624
H  4.737941 1.111403 3.101323
H  4.333475 -0.601253 3.290818
H  2.56263 1.739586 4.141113
H  2.14605 0.040664 4.314289
H  3.059139 0.945205 6.450504
H  4.131273 -0.29848 5.820553
H  4.554731 1.40307 5.646692
elementType: F O N C H
totalener: -1864.68087614 hartree
nucrepener: 3756.94003932 hartree
electener: -5621.62091545 hartree
twoeener: 4411.37805074 hartree
cpcmener: -0.03061990 hartree
kineticenergy: 1857.35142658 hartree
xcener: -168.785368565127 hartree
chargesum: -0.0000000
charge: -0.189166 -0.183603 -0.189126 -0.184375 -0.181026 -0.183483 -0.324721 -0.294572 -0.321292 -0.023233 -0.370348 0.083064 0.162907 -0.198491 -0.245465 0.134716 -0.209730 -0.224887 -0.120787 0.270454 0.436501 0.139100 -0.182373 -0.255788 -0.182177 -0.211463 -0.107285 -0.092701 0.003601 -0.099498 0.027817 0.558033 0.554880 -0.092310 -0.278621 0.095196 0.085202 0.094988 0.091266 0.101821 0.094183 0.089051 0.077538 0.088936 0.089189 0.077970 0.079375 0.082731 0.137177 0.149000 0.126825 0.149528 0.157940 0.130923 0.094271 0.094083 0.065127 0.063953 0.094070 0.082728 0.082377
qa: -0.1892 -0.1836 -0.1891 -0.1844 -0.1810 -0.1835 -0.3247 -0.2946 -0.3213 -0.0232 -0.3703 0.0831 0.1629 -0.1985 -0.2455 0.1347 -0.2097 -0.2249 -0.1208 0.2705 0.4365 0.1391 -0.1824 -0.2558 -0.1822 -0.2115 -0.1073 -0.0927 0.0036 -0.0995 0.0278 0.5580 0.5549 -0.0923 -0.2786 0.0952 0.0852 0.0950 0.0913 0.1018 0.0942 0.0891 0.0775 0.0889 0.0892 0.0780 0.0794 0.0827 0.1372 0.1490 0.1268 0.1495 0.1579 0.1309 0.0943 0.0941 0.0651 0.0640 0.0941 0.0827 0.0824
va: 1.1023 1.1166 1.1033 1.1090 1.1223 1.1071 2.0824 2.1318 2.0821 2.7637 3.0311 3.9186 3.9229 3.9258 3.9021 3.8640 3.9880 3.9651 3.9003 3.9694 3.9225 4.0633 3.8930 4.0349 3.9210 4.0284 3.7725 3.9934 4.1110 3.6458 3.8436 4.4302 4.4293 3.9125 3.9479 1.0106 1.0059 1.0306 1.0172 1.0113 1.0320 0.9971 1.0140 1.0141 1.0132 1.0133 1.0017 1.0090 1.0117 1.0040 1.0342 1.0089 1.0038 1.0092 0.9873 0.9884 1.0112 1.0118 1.0035 1.0009 1.0012
dispcorr: -0.030548391 hartree
energy: -1864.711424527913
dipole: 16.48793 -16.43501 0.05292 10.33418 -10.28929 0.04489 -0.78892 0.78705 -0.00187
magnitude: 0.06942 au
magnitude: 0.17646 debye
