program: Orca
programVersion: 5.0.2
elementType: F F F F F F O O O N N C C C C C C C C C C C C C C C C C C C C C C C C H H H H H H H H H H H H H H H H H H H H H H H H H H
charge: 0
multiplicity: 1
keywords: wb97x-d3
keywords: def2-TZVPP
keywords: def2/J RIJCOSX
keywords: DEFGRID2
keywords: scfconv7
keywords: smallprint printgap noloewdin
keywords: NOSOSCF
formula: C24H26F6N2O3
InChI: InChI=1/C24H26F6N2O3/c1-2-10-33-21-11-15(23(25,26)27)6-8-20(21)34-19-12-17-4-3-5-18(13-19)32(17)35-22-9-7-16(14-31-22)24(28,29)30/h6-9,11,14,17-19H,2-5,10,12-13H2,1H3
61 atoms
F  7.628659 -0.582935 -1.961564
F  7.908117 0.095355 0.061565
F  7.488809 -1.97063 -0.323574
F  -8.239462 -1.266294 1.313501
F  -7.720482 0.434837 2.514961
F  -8.405782 0.719407 0.496004
O  1.716587 0.374859 -0.010751
O  -2.424533 -0.394075 -0.536599
O  3.123666 -0.280768 2.002213
N  -2.098389 0.374037 -1.68301
N  -4.506372 0.591276 -0.665847
C  -1.562648 1.668633 -1.26103
C  -1.093711 -0.380164 -2.428677
C  -0.301346 1.537526 -0.400555
C  0.214201 -0.590569 -1.650115
C  0.784744 0.691035 -1.048852
C  -1.41362 2.497533 -2.540114
C  -0.937537 0.342906 -3.769039
C  -0.58091 1.820732 -3.627101
C  2.99534 0.089627 -0.291139
C  -3.696372 -0.293061 -0.130793
C  3.784131 -0.247366 0.834424
C  3.582199 0.112858 -1.544041
C  -4.073664 -1.161333 0.902283
C  5.129992 -0.508277 0.676358
C  4.94207 -0.148921 -1.697462
C  5.713738 -0.449022 -0.59433
C  -5.364691 -1.086286 1.360112
C  -5.755616 0.654066 -0.216299
C  -6.242237 -0.159918 0.787317
C  3.82941 -0.613136 3.18885
C  7.175772 -0.723809 -0.711589
C  -7.647817 -0.063147 1.270995
C  2.852181 -0.58818 4.343978
C  2.201768 0.767919 4.573399
H  -2.326533 2.16059 -0.655473
H  -1.51509 -1.365635 -2.640655
H  -0.574698 1.085488 0.557091
H  0.08362 2.534663 -0.174874
H  0.941934 -1.070887 -2.308996
H  0.027625 -1.293454 -0.833263
H  1.295627 1.286244 -1.806977
H  -0.994761 3.47321 -2.285459
H  -2.420721 2.68161 -2.923424
H  -1.885047 0.249479 -4.305743
H  -0.187394 -0.177666 -4.36809
H  0.484392 1.938769 -3.424938
H  -0.751353 2.327163 -4.579556
H  3.001973 0.340766 -2.427283
H  -3.368412 -1.869095 1.316645
H  5.738007 -0.758024 1.536241
H  5.365408 -0.110419 -2.69125
H  -5.687445 -1.746808 2.155341
H  -6.382626 1.399629 -0.689761
H  4.639907 0.105255 3.360149
H  4.278645 -1.608193 3.094933
H  2.087717 -1.35503 4.192445
H  3.410836 -0.886053 5.234801
H  1.582944 1.073799 3.729457
H  1.559278 0.743962 5.45421
H  2.951007 1.545394 4.73572
elementType: F O N C H
totalener: -1864.68071749 hartree
nucrepener: 3779.87489936 hartree
electener: -5644.55561685 hartree
twoeener: 4434.39701648 hartree
cpcmener: -0.03041268 hartree
kineticenergy: 1857.33560385 hartree
xcener: -168.782147252287 hartree
chargesum: 0.0000000
charge: -0.183633 -0.189634 -0.188689 -0.184386 -0.183016 -0.181292 -0.321899 -0.293865 -0.323832 -0.023935 -0.369769 0.080695 0.157449 -0.197180 -0.238505 0.131458 -0.208483 -0.220512 -0.123149 0.273190 0.436059 0.134222 -0.181275 -0.256951 -0.177284 -0.208332 -0.105241 -0.090597 0.003290 -0.099651 0.006335 0.556968 0.553695 -0.117568 -0.254422 0.096342 0.086748 0.095480 0.091614 0.099302 0.092401 0.086858 0.078053 0.088420 0.088029 0.077247 0.080012 0.083063 0.137695 0.149030 0.129793 0.148796 0.157474 0.131211 0.101715 0.110298 0.064543 0.067051 0.079805 0.091072 0.077686
qa: -0.1836 -0.1896 -0.1887 -0.1844 -0.1830 -0.1813 -0.3219 -0.2939 -0.3238 -0.0239 -0.3698 0.0807 0.1574 -0.1972 -0.2385 0.1315 -0.2085 -0.2205 -0.1231 0.2732 0.4361 0.1342 -0.1813 -0.2570 -0.1773 -0.2083 -0.1052 -0.0906 0.0033 -0.0997 0.0063 0.5570 0.5537 -0.1176 -0.2544 0.0963 0.0867 0.0955 0.0916 0.0993 0.0924 0.0869 0.0781 0.0884 0.0880 0.0772 0.0800 0.0831 0.1377 0.1490 0.1298 0.1488 0.1575 0.1312 0.1017 0.1103 0.0645 0.0671 0.0798 0.0911 0.0777
va: 1.1162 1.1033 1.1022 1.1102 1.1057 1.1214 2.0817 2.1318 2.0808 2.7645 3.0308 3.9258 3.9316 3.9373 3.9066 3.8729 3.9879 3.9641 3.9040 3.9602 3.9237 4.0520 3.8991 4.0338 3.9280 4.0210 3.7663 3.9895 4.1123 3.6431 3.8374 4.4310 4.4293 3.9427 3.9174 1.0109 1.0059 1.0297 1.0169 1.0116 1.0323 0.9975 1.0139 1.0141 1.0137 1.0135 1.0015 1.0091 1.0113 1.0040 1.0304 1.0093 1.0037 1.0092 0.9876 0.9918 1.0133 1.0111 1.0126 1.0046 1.0031
dispcorr: -0.031015322 hartree
energy: -1864.711732812169
dipole: 12.39576 -12.35359 0.04216 12.09753 -12.09783 -0.00029 -1.95928 1.91528 -0.04399
magnitude: 0.06094 au
magnitude: 0.15489 debye
