program: Orca
programVersion: 5.0.2
elementType: F F F F F F O O O N N C C C C C C C C C C C C C C C C C C C C C C C C H H H H H H H H H H H H H H H H H H H H H H H H H H
charge: 0
multiplicity: 1
keywords: wb97x-d3
keywords: def2-TZVPP
keywords: def2/J RIJCOSX
keywords: DEFGRID2
keywords: scfconv7
keywords: smallprint printgap noloewdin
keywords: NOSOSCF
formula: C24H26F6N2O3
InChI: InChI=1/C24H26F6N2O3/c1-2-10-33-21-11-15(23(25,26)27)6-8-20(21)34-19-12-17-4-3-5-18(13-19)32(17)35-22-9-7-16(14-31-22)24(28,29)30/h6-9,11,14,17-19H,2-5,10,12-13H2,1H3
61 atoms
F  6.581367 -3.029299 -0.138066
F  6.714246 -2.274707 -2.148511
F  7.605965 -1.181907 -0.524687
F  -7.880101 -1.844137 -0.018506
F  -7.227787 -2.2708 1.987072
F  -8.207221 -0.409688 1.549309
O  1.806077 0.951443 0.109872
O  -2.410273 1.041346 0.078757
O  3.367828 0.422556 2.049208
N  -2.110167 1.465788 -1.241095
N  -4.379729 0.159239 -0.749223
C  -1.292446 2.67076 -1.097077
C  -1.350595 0.412383 -1.916936
C  0.008163 2.419841 -0.321054
C  -0.048145 0.054935 -1.189518
C  0.828001 1.267347 -0.88456
C  -1.108806 3.241341 -2.506281
C  -1.184133 0.869885 -3.368572
C  -0.535702 2.245056 -3.512535
C  2.903024 0.256085 -0.222221
C  -3.61433 0.490896 0.264643
C  3.772872 -0.03422 0.854972
C  3.238101 -0.169232 -1.495207
C  -3.963394 0.273082 1.60401
C  4.937971 -0.737712 0.625319
C  4.416129 -0.875124 -1.722183
C  5.259894 -1.158871 -0.66984
C  -5.173172 -0.31707 1.860564
C  -5.553522 -0.411019 -0.488385
C  -5.999977 -0.67618 0.791693
C  4.197132 0.23972 3.187383
C  6.531775 -1.908322 -0.876051
C  -7.324566 -1.299934 1.066908
C  3.536355 0.927749 4.362439
C  3.369465 2.428618 4.175573
H  -1.880977 3.397785 -0.532728
H  -1.975255 -0.483134 -1.936648
H  -0.23776 2.200119 0.72128
H  0.602319 3.336476 -0.312665
H  0.489806 -0.684097 -1.78702
H  -0.293747 -0.436114 -0.243616
H  1.351337 1.602237 -1.781376
H  -0.478243 4.130731 -2.444927
H  -2.088097 3.57924 -2.85415
H  -2.178815 0.891606 -3.821123
H  -0.611981 0.115926 -3.913085
H  0.547633 2.172559 -3.409631
H  -0.702391 2.619355 -4.524829
H  2.596071 0.035683 -2.339917
H  -3.296805 0.565833 2.4036
H  5.605372 -0.964826 1.446918
H  4.642349 -1.191129 -2.730666
H  -5.471984 -0.495407 2.885698
H  -6.149612 -0.666679 -1.356368
H  5.18973 0.669402 3.006327
H  4.328227 -0.828686 3.392529
H  2.568919 0.459527 4.563293
H  4.158928 0.729997 5.23846
H  2.941014 2.885604 5.068328
H  4.329462 2.913938 3.987911
H  2.708805 2.666186 3.341299
elementType: F O N C H
totalener: -1864.68099724 hartree
nucrepener: 3787.67222863 hartree
electener: -5652.35322587 hartree
twoeener: 4442.15751184 hartree
cpcmener: -0.03050816 hartree
kineticenergy: 1857.35253714 hartree
xcener: -168.785563351075 hartree
chargesum: 0.0000000
charge: -0.189097 -0.183718 -0.189251 -0.180656 -0.184452 -0.183308 -0.324397 -0.292108 -0.324062 -0.027095 -0.370715 0.105932 0.141014 -0.194090 -0.250173 0.127476 -0.207231 -0.223547 -0.124333 0.285393 0.432364 0.128868 -0.187783 -0.258298 -0.177630 -0.213102 -0.101610 -0.087610 0.003649 -0.097177 0.004036 0.557516 0.553777 -0.115354 -0.253958 0.086699 0.092678 0.092580 0.090984 0.105893 0.096474 0.093002 0.076406 0.088149 0.089923 0.078605 0.080844 0.083302 0.139086 0.149002 0.129286 0.148687 0.155853 0.131782 0.100965 0.111197 0.064553 0.067241 0.090800 0.077708 0.079031
qa: -0.1891 -0.1837 -0.1893 -0.1807 -0.1845 -0.1833 -0.3244 -0.2921 -0.3241 -0.0271 -0.3707 0.1059 0.1410 -0.1941 -0.2502 0.1275 -0.2072 -0.2235 -0.1243 0.2854 0.4324 0.1289 -0.1878 -0.2583 -0.1776 -0.2131 -0.1016 -0.0876 0.0036 -0.0972 0.0040 0.5575 0.5538 -0.1154 -0.2540 0.0867 0.0927 0.0926 0.0910 0.1059 0.0965 0.0930 0.0764 0.0881 0.0899 0.0786 0.0808 0.0833 0.1391 0.1490 0.1293 0.1487 0.1559 0.1318 0.1010 0.1112 0.0646 0.0672 0.0908 0.0777 0.0790
va: 1.1034 1.1163 1.1024 1.1224 1.1108 1.1040 2.0846 2.1338 2.0786 2.7716 3.0348 3.9819 3.8969 3.9481 3.8767 3.8633 3.9672 3.9809 3.9049 3.9497 3.9281 4.0584 3.8958 4.0384 3.9313 4.0289 3.7673 3.9887 4.1136 3.6379 3.8406 4.4289 4.4289 3.9403 3.9167 1.0073 1.0095 1.0317 1.0164 1.0110 1.0318 0.9960 1.0140 1.0129 1.0132 1.0139 1.0023 1.0091 1.0099 1.0039 1.0301 1.0099 1.0050 1.0092 0.9877 0.9915 1.0138 1.0112 1.0048 1.0032 1.0135
dispcorr: -0.031064252 hartree
energy: -1864.712061490016
dipole: 18.10753 -17.87789 0.22964 37.50025 -36.24574 1.25451 1.09338 -0.81922 0.27416
magnitude: 1.30449 au
magnitude: 3.31575 debye
