program: Orca
programVersion: 5.0.2
elementType: F F F F F F O O O N N C C C C C C C C C C C C C C C C C C C C C C C C H H H H H H H H H H H H H H H H H H H H H H H H H H
charge: 0
multiplicity: 1
keywords: wb97x-d3
keywords: def2-TZVPP
keywords: def2/J RIJCOSX
keywords: DEFGRID2
keywords: scfconv7
keywords: smallprint printgap noloewdin
keywords: NOSOSCF
formula: C24H26F6N2O3
InChI: InChI=1/C24H26F6N2O3/c1-2-10-33-21-11-15(23(25,26)27)6-8-20(21)34-19-12-17-4-3-5-18(13-19)32(17)35-22-9-7-16(14-31-22)24(28,29)30/h6-9,11,14,17-19H,2-5,10,12-13H2,1H3
61 atoms
F  7.218467 -1.722186 1.100533
F  7.885388 0.105714 0.196897
F  7.282571 0.086777 2.265597
F  -8.783909 -0.983333 0.087499
F  -7.793422 -1.786619 -1.649673
F  -7.541258 -2.73294 0.259637
O  1.759708 0.620789 -0.72076
O  -3.332236 1.754144 0.778111
O  3.35075 -0.69689 -2.213947
N  -2.050335 1.355472 0.35512
N  -5.492292 1.283109 0.863357
C  -1.224843 1.138603 1.544168
C  -1.495306 2.427721 -0.470987
C  0.094338 0.541128 1.046122
C  -0.199437 1.873868 -1.064528
C  0.794787 1.386428 -0.017766
C  -1.094462 2.395046 2.410415
C  -1.367607 3.753956 0.286661
C  -0.645851 3.631318 1.629757
C  2.982139 0.421869 -0.207435
C  -4.308583 0.887505 0.449855
C  3.863524 -0.313188 -1.034191
C  3.430576 0.876138 1.019935
C  -4.096833 -0.303675 -0.249905
C  5.150648 -0.560211 -0.600424
C  4.731462 0.622284 1.447162
C  5.5883 -0.094225 0.641984
C  -5.198555 -1.088734 -0.506785
C  -6.541435 0.51891 0.608983
C  -6.458139 -0.683689 -0.073303
C  4.119295 -1.498864 -3.086294
C  6.990589 -0.401218 1.057577
C  -7.649402 -1.540659 -0.340959
C  4.174225 -2.961726 -2.673158
C  5.008029 -3.775633 -3.652485
H  -1.714494 0.361222 2.137312
H  -2.184032 2.576277 -1.306869
H  -0.122199 -0.434089 0.601778
H  0.748102 0.358122 1.901407
H  0.266914 2.629666 -1.699729
H  -0.456698 1.029515 -1.709196
H  1.290905 2.248379 0.43672
H  -0.406454 2.194103 3.235324
H  -2.064909 2.593297 2.869978
H  -2.373079 4.144796 0.456115
H  -0.863725 4.484739 -0.350564
H  0.435606 3.619391 1.483612
H  -0.84124 4.524742 2.225838
H  2.778074 1.43665 1.6745
H  -3.110961 -0.593111 -0.576639
H  5.83515 -1.120147 -1.22316
H  5.045009 0.990555 2.412985
H  -5.07081 -2.017866 -1.04775
H  -7.49126 0.892967 0.971465
H  5.129907 -1.089754 -3.211536
H  3.627858 -1.410703 -4.056704
H  4.587547 -3.06347 -1.667071
H  3.155856 -3.354075 -2.627473
H  4.609539 -3.716655 -4.666602
H  6.041808 -3.427752 -3.684643
H  5.027776 -4.827216 -3.370039
totalener: -1864.65224523 hartree
nucrepener: 3746.76031244 hartree
electener: -5611.41255767 hartree
twoeener: 4399.97205797 hartree
kineticenergy: 1857.39734512 hartree
xcener: -168.793855751819 hartree
chargesum: 0.0000000
charge: -0.178394 -0.177700 -0.175995 -0.173328 -0.173695 -0.172444 -0.272500 -0.256960 -0.279367 -0.028018 -0.298162 0.140547 0.096118 -0.271523 -0.228611 0.152668 -0.211356 -0.194297 -0.142932 0.278562 0.326919 0.127399 -0.157704 -0.182791 -0.166802 -0.188806 -0.116263 -0.131387 -0.006658 -0.073059 -0.012683 0.545804 0.547446 -0.118299 -0.253090 0.081575 0.078377 0.100683 0.094515 0.084022 0.100558 0.073528 0.074001 0.102333 0.100746 0.074303 0.072975 0.082460 0.103860 0.132356 0.107378 0.130073 0.128863 0.121497 0.080539 0.106152 0.077828 0.072589 0.076435 0.078593 0.091119
qa: -0.1784 -0.1777 -0.1760 -0.1733 -0.1737 -0.1724 -0.2725 -0.2570 -0.2794 -0.0280 -0.2982 0.1405 0.0961 -0.2715 -0.2286 0.1527 -0.2114 -0.1943 -0.1429 0.2786 0.3269 0.1274 -0.1577 -0.1828 -0.1668 -0.1888 -0.1163 -0.1314 -0.0067 -0.0731 -0.0127 0.5458 0.5474 -0.1183 -0.2531 0.0816 0.0784 0.1007 0.0945 0.0840 0.1006 0.0735 0.0740 0.1023 0.1007 0.0743 0.0730 0.0825 0.1039 0.1324 0.1074 0.1301 0.1289 0.1215 0.0805 0.1062 0.0778 0.0726 0.0764 0.0786 0.0911
va: 1.1190 1.1202 1.1276 1.1331 1.1232 1.1227 2.1370 2.1134 2.1287 2.7800 3.0794 3.9178 3.9559 3.9121 3.9886 3.8596 3.9372 3.9377 3.9280 3.9820 4.1078 4.0476 3.9147 3.9480 3.9191 4.0813 3.8957 4.0584 4.1067 3.6773 3.9163 4.4439 4.4393 3.8521 3.9425 1.0031 1.0092 1.0283 1.0149 1.0199 1.0285 1.0036 1.0159 1.0167 1.0173 1.0158 1.0039 1.0117 1.0201 1.0340 1.0313 1.0160 1.0173 1.0130 0.9945 0.9978 1.0103 1.0127 1.0037 1.0040 1.0055
dispcorr: -0.031397972 hartree
energy: -1864.683643205628
dipole: 22.42454 -21.96127 0.46327 14.03747 -13.76006 0.27741 -11.96573 11.44793 -0.51780
magnitude: 0.74813 au
magnitude: 1.90159 debye
