program: Orca
programVersion: 5.0.2
elementType: F F F F F F O O O N N C C C C C C C C C C C C C C C C C C C C C C C C H H H H H H H H H H H H H H H H H H H H H H H H H H
charge: 0
multiplicity: 1
keywords: wb97x-d3
keywords: def2-TZVPP
keywords: def2/J RIJCOSX
keywords: DEFGRID2
keywords: scfconv7
keywords: smallprint printgap noloewdin
keywords: NOSOSCF
formula: C24H26F6N2O3
InChI: InChI=1/C24H26F6N2O3/c1-2-10-33-21-11-15(23(25,26)27)6-8-20(21)34-19-12-17-4-3-5-18(13-19)32(17)35-22-9-7-16(14-31-22)24(28,29)30/h6-9,11,14,17-19H,2-5,10,12-13H2,1H3
61 atoms
F  7.661945 1.138207 1.446352
F  7.731083 -0.948565 0.921169
F  7.929073 0.547499 -0.605668
F  -8.634522 -0.505018 0.892331
F  -8.58021 0.626728 -0.928656
F  -8.29391 -1.50841 -0.983622
O  1.75221 0.147872 -0.493941
O  -2.524594 0.169226 0.317527
O  3.30288 -1.351625 -1.85222
N  -2.045031 1.42602 0.731188
N  -4.308555 -1.024092 -0.245809
C  -1.064402 1.229581 1.793506
C  -1.441539 2.102705 -0.41458
C  0.18987 0.471713 1.329423
C  -0.238355 1.341174 -0.984957
C  0.820924 1.058894 0.06963
C  -0.806565 2.621699 2.377558
C  -1.173135 3.541452 0.042422
C  -0.36682 3.652683 1.338347
C  3.045453 0.20804 -0.148016
C  -3.867989 0.124457 0.2181
C  3.907859 -0.607853 -0.916834
C  3.582471 0.988684 0.859919
C  -4.70965 1.187219 0.560643
C  5.267014 -0.57983 -0.677906
C  4.955584 1.012945 1.092696
C  5.795998 0.241389 0.322715
C  -6.062668 1.005427 0.385168
C  -5.611937 -1.185408 -0.406945
C  -6.543037 -0.200892 -0.116329
C  4.075072 -2.227782 -2.643736
C  7.276168 0.249388 0.526822
C  -8.011426 -0.403869 -0.289128
C  3.138402 -2.981163 -3.565337
C  2.119661 -3.837443 -2.826789
H  -1.545304 0.633681 2.5727
H  -2.203225 2.156858 -1.197597
H  -0.08321 -0.564507 1.114746
H  0.911945 0.436244 2.149777
H  0.196067 1.909228 -1.810975
H  -0.583889 0.393036 -1.404012
H  1.342859 1.990834 0.294703
H  -0.068019 2.547828 3.17891
H  -1.737221 2.955662 2.842218
H  -2.145966 4.017074 0.189874
H  -0.680147 4.090955 -0.762243
H  0.700954 3.560649 1.136303
H  -0.489306 4.656026 1.7510
H  2.94795 1.59802 1.488138
H  -4.313624 2.111025 0.950179
H  5.933733 -1.187151 -1.275186
H  5.340029 1.643985 1.880602
H  -6.740981 1.80993 0.639071
H  -5.918782 -2.150594 -0.79181
H  4.626402 -2.933212 -2.007421
H  4.813077 -1.665288 -3.229839
H  2.631087 -2.270485 -4.222084
H  3.755276 -3.610012 -4.21242
H  1.461034 -3.230663 -2.207585
H  1.497587 -4.392582 -3.528198
H  2.610537 -4.56442 -2.177504
totalener: -1864.65375716 hartree
nucrepener: 3764.32658891 hartree
electener: -5628.98034607 hartree
twoeener: 4417.76662341 hartree
kineticenergy: 1857.39590435 hartree
xcener: -168.791816018013 hartree
chargesum: 0.0000000
charge: -0.177178 -0.176726 -0.178740 -0.170519 -0.175133 -0.172824 -0.281419 -0.244028 -0.276179 -0.055608 -0.293988 0.163969 0.103540 -0.257547 -0.195948 0.132702 -0.233450 -0.223167 -0.120942 0.292032 0.325890 0.125304 -0.163580 -0.191708 -0.144907 -0.187888 -0.123353 -0.128088 -0.005804 -0.071788 -0.012499 0.544491 0.545448 -0.117806 -0.236078 0.079471 0.089010 0.109254 0.091974 0.081324 0.109061 0.057190 0.077400 0.092573 0.092098 0.079156 0.077917 0.085183 0.098046 0.130176 0.104897 0.129567 0.128938 0.121306 0.086257 0.095819 0.064085 0.058151 0.094746 0.083620 0.066298
qa: -0.1772 -0.1767 -0.1787 -0.1705 -0.1751 -0.1728 -0.2814 -0.2440 -0.2762 -0.0556 -0.2940 0.1640 0.1035 -0.2575 -0.1959 0.1327 -0.2335 -0.2232 -0.1209 0.2920 0.3259 0.1253 -0.1636 -0.1917 -0.1449 -0.1879 -0.1234 -0.1281 -0.0058 -0.0718 -0.0125 0.5445 0.5454 -0.1178 -0.2361 0.0795 0.0890 0.1093 0.0920 0.0813 0.1091 0.0572 0.0774 0.0926 0.0921 0.0792 0.0779 0.0852 0.0980 0.1302 0.1049 0.1296 0.1289 0.1213 0.0863 0.0958 0.0641 0.0582 0.0947 0.0836 0.0663
va: 1.1259 1.1197 1.1192 1.1220 1.1232 1.1334 2.1230 2.1205 2.1280 2.7985 3.0803 3.9008 3.9159 3.9322 3.9573 3.8825 3.9534 3.9728 3.8906 3.9666 4.1070 4.0681 3.9142 3.9459 3.9286 4.0771 3.9151 4.0519 4.1066 3.6743 3.8840 4.4436 4.4382 3.9636 3.9209 1.0067 0.9997 1.0308 1.0137 1.0204 1.0311 1.0138 1.0155 1.0135 1.0103 1.0160 1.0048 1.0113 1.0223 1.0339 1.0361 1.0162 1.0173 1.0127 0.9858 0.9896 1.0142 1.0104 1.0133 1.0064 1.0059
dispcorr: -0.031401896 hartree
energy: -1864.685159054753
dipole: 14.51487 -14.73288 -0.21801 6.35851 -5.17707 1.18144 -7.12778 7.21971 0.09193
magnitude: 1.20490 au
magnitude: 3.06260 debye
