program: Orca
programVersion: 5.0.2
elementType: F F F F F F O O O N N C C C C C C C C C C C C C C C C C C C C C C C C H H H H H H H H H H H H H H H H H H H H H H H H H H
charge: 0
multiplicity: 1
keywords: wb97x-d3
keywords: def2-TZVPP
keywords: def2/J RIJCOSX
keywords: DEFGRID2
keywords: scfconv7
keywords: smallprint printgap noloewdin
keywords: NOSOSCF
formula: C24H26F6N2O3
InChI: InChI=1/C24H26F6N2O3/c1-2-10-33-21-11-15(23(25,26)27)6-8-20(21)34-19-12-17-4-3-5-18(13-19)32(17)35-22-9-7-16(14-31-22)24(28,29)30/h6-9,11,14,17-19H,2-5,10,12-13H2,1H3
61 atoms
F  6.798016 -2.761616 0.205673
F  7.814257 -0.874206 0.141527
F  7.130642 -1.663171 2.027476
F  -7.749628 -2.290377 0.271024
F  -8.412456 -0.371209 -0.422705
F  -7.632442 -1.812375 -1.824443
O  1.895057 1.010888 -0.241712
O  -2.297234 0.560225 0.066613
O  3.293998 0.18283 -2.205458
N  -1.980647 1.265075 1.242846
N  -3.84092 -0.518488 -1.095117
C  -1.071156 0.444279 2.039644
C  -1.338649 2.519735 0.858515
C  0.238773 0.128317 1.305591
C  -0.041306 2.304382 0.06818
C  0.946192 1.365742 0.752649
C  -0.921201 1.157301 3.386094
C  -1.201732 3.338172 2.145293
C  -0.460677 2.608351 3.264229
C  3.05136 0.423166 0.09516
C  -3.582483 0.167567 -0.003493
C  3.825716 -0.035177 -0.995729
C  3.532643 0.249291 1.379918
C  -4.54209 0.449642 0.97279
C  5.034633 -0.657249 -0.760816
C  4.754496 -0.379668 1.608183
C  5.50068 -0.835426 0.544762
C  -5.816126 -0.029756 0.763752
C  -5.069043 -0.971477 -1.282846
C  -6.103437 -0.760438 -0.385356
C  3.978496 -0.273715 -3.351755
C  6.808452 -1.531059 0.737792
C  -7.473693 -1.309813 -0.598157
C  3.143713 0.069241 -4.567681
C  1.774979 -0.596574 -4.572644
H  -1.578153 -0.50494 2.233885
H  -2.037668 3.053915 0.21019
H  0.01517 -0.532127 0.464195
H  0.892241 -0.437723 1.973235
H  0.432418 3.269713 -0.12541
H  -0.291706 1.880828 -0.907064
H  1.463418 1.904177 1.552663
H  -0.239212 0.588728 4.022073
H  -1.89691 1.132429 3.878421
H  -2.211686 3.580594 2.485557
H  -0.713381 4.288108 1.917975
H  0.617264 2.656883 3.104678
H  -0.632492 3.124882 4.210716
H  2.967378 0.595099 2.233914
H  -4.293914 1.02232 1.851887
H  5.628532 -1.01527 -1.590773
H  5.095463 -0.50381 2.625624
H  -6.584102 0.171108 1.499878
H  -5.22619 -1.530695 -2.197239
H  4.135994 -1.359293 -3.295722
H  4.965687 0.200249 -3.422601
H  3.037362 1.154586 -4.635648
H  3.712373 -0.23834 -5.448999
H  1.228945 -0.35446 -5.483952
H  1.863234 -1.683159 -4.522783
H  1.169136 -0.273751 -3.72766
totalener: -1864.65487835 hartree
nucrepener: 3789.99223933 hartree
electener: -5654.64711768 hartree
twoeener: 4443.56377449 hartree
kineticenergy: 1857.40957941 hartree
xcener: -168.794222935384 hartree
chargesum: -0.0000000
charge: -0.177718 -0.177836 -0.177249 -0.170864 -0.174760 -0.173071 -0.279461 -0.244782 -0.274815 -0.045462 -0.296910 0.154824 0.090989 -0.271513 -0.201723 0.127613 -0.229862 -0.207589 -0.126194 0.263498 0.323426 0.144045 -0.161327 -0.184667 -0.156263 -0.184752 -0.120888 -0.130109 -0.007292 -0.071975 -0.013289 0.546139 0.546147 -0.120112 -0.236272 0.085284 0.079642 0.114723 0.099134 0.083272 0.112131 0.070655 0.077663 0.091990 0.090206 0.076810 0.077977 0.085137 0.105428 0.130762 0.105869 0.130049 0.128855 0.121380 0.087357 0.096989 0.063845 0.059274 0.083079 0.066384 0.096175
qa: -0.1777 -0.1778 -0.1772 -0.1709 -0.1748 -0.1731 -0.2795 -0.2448 -0.2748 -0.0455 -0.2969 0.1548 0.0910 -0.2715 -0.2017 0.1276 -0.2299 -0.2076 -0.1262 0.2635 0.3234 0.1440 -0.1613 -0.1847 -0.1563 -0.1848 -0.1209 -0.1301 -0.0073 -0.0720 -0.0133 0.5461 0.5461 -0.1201 -0.2363 0.0853 0.0796 0.1147 0.0991 0.0833 0.1121 0.0707 0.0777 0.0920 0.0902 0.0768 0.0780 0.0851 0.1054 0.1308 0.1059 0.1300 0.1289 0.1214 0.0874 0.0970 0.0638 0.0593 0.0831 0.0664 0.0962
va: 1.1198 1.1197 1.1260 1.1221 1.1236 1.1330 2.1296 2.1226 2.1279 2.7844 3.0800 3.9100 3.9668 3.9030 3.9807 3.8727 3.9649 3.9588 3.8940 3.9828 4.1072 4.0694 3.8985 3.9480 3.9439 4.0688 3.9128 4.0552 4.1088 3.6752 3.8819 4.4428 4.4388 3.9630 3.9228 1.0006 1.0084 1.0306 1.0138 1.0194 1.0290 1.0025 1.0161 1.0119 1.0141 1.0160 1.0070 1.0115 1.0171 1.0345 1.0365 1.0158 1.0172 1.0131 0.9852 0.9895 1.0142 1.0103 1.0063 1.0062 1.0125
dispcorr: -0.031422567 hartree
energy: -1864.686300914241
dipole: 12.82964 -13.14413 -0.31449 29.24643 -27.87608 1.37035 -1.85362 2.68800 0.83438
magnitude: 1.63492 au
magnitude: 4.15563 debye
