program: Orca
programVersion: 5.0.2
elementType: F F F F F F O O O N N C C C C C C C C C C C C C C C C C C C C C C C C H H H H H H H H H H H H H H H H H H H H H H H H H H
charge: 0
multiplicity: 1
keywords: wb97x-d3
keywords: def2-TZVPP
keywords: def2/J RIJCOSX
keywords: DEFGRID2
keywords: scfconv7
keywords: smallprint printgap noloewdin
keywords: NOSOSCF
formula: C24H26F6N2O3
InChI: InChI=1/C24H26F6N2O3/c1-2-10-33-21-11-15(23(25,26)27)6-8-20(21)34-19-12-17-4-3-5-18(13-19)32(17)35-22-9-7-16(14-31-22)24(28,29)30/h6-9,11,14,17-19H,2-5,10,12-13H2,1H3
61 atoms
F  7.248493 -2.063294 -0.883732
F  7.958303 -0.310354 0.124516
F  7.351316 -2.030253 1.268479
F  -7.765002 -0.86004 -2.355173
F  -8.380039 -1.147336 -0.309818
F  -8.242399 0.837313 -1.119381
O  1.850319 0.83853 0.139724
O  -2.315666 0.100039 0.307035
O  3.291994 0.987726 -1.957535
N  -1.994971 0.349377 1.654742
N  -3.906922 -0.23897 -1.193308
C  -1.032564 -0.662034 2.083519
C  -1.411341 1.686753 1.750724
C  0.26942 -0.62614 1.269564
C  -0.130519 1.833887 0.91912
C  0.912664 0.759127 1.202561
C  -0.871818 -0.484065 3.595838
C  -1.271418 1.983237 3.246592
C  -0.471302 0.930258 4.011041
C  3.068934 0.293619 0.252856
C  -3.636442 -0.019397 0.074923
C  3.868791 0.382994 -0.910284
C  3.590153 -0.315741 1.379876
C  -4.618386 0.082017 1.064198
C  5.146382 -0.138372 -0.901372
C  4.880586 -0.841267 1.37892
C  5.655276 -0.757728 0.243339
C  -5.930776 -0.04833 0.666989
C  -5.171258 -0.363865 -1.55921
C  -6.232698 -0.276506 -0.672351
C  3.995631 1.062701 -3.178861
C  7.049678 -1.293633 0.195658
C  -7.653347 -0.36645 -1.119646
C  3.077253 1.667546 -4.219601
C  1.837096 0.82842 -4.491831
H  -1.496754 -1.638294 1.921992
H  -2.148049 2.390054 1.352695
H  0.04975 -0.943369 0.247273
H  0.962564 -1.366206 1.676825
H  0.299256 2.824994 1.082239
H  -0.393767 1.78076 -0.13973
H  1.427419 0.991228 2.139359
H  -0.150139 -1.213754 3.969696
H  -1.831495 -0.732677 4.056122
H  -2.280808 2.035441 3.663181
H  -0.829576 2.973146 3.378948
H  0.599095 1.084344 3.868413
H  -0.637493 1.055236 5.08282
H  3.002812 -0.400366 2.283388
H  -4.357394 0.253834 2.096008
H  5.761958 -0.07345 -1.788025
H  5.25165 -1.314597 2.276425
H  -6.71656 0.026174 1.40773
H  -5.336736 -0.544391 -2.614593
H  4.314381 0.061661 -3.499873
H  4.899306 1.674537 -3.061155
H  2.793325 2.675874 -3.908677
H  3.659744 1.782515 -5.137666
H  1.228697 1.277904 -5.276101
H  2.105002 -0.177333 -4.820326
H  1.215388 0.733131 -3.602987
totalener: -1864.65491407 hartree
nucrepener: 3780.82486732 hartree
electener: -5645.47978139 hartree
twoeener: 4434.38181872 hartree
kineticenergy: 1857.39027629 hartree
xcener: -168.790352093054 hartree
chargesum: -0.0000000
charge: -0.179417 -0.175766 -0.176939 -0.172868 -0.175147 -0.170244 -0.276720 -0.244623 -0.276038 -0.046876 -0.296988 0.154938 0.097483 -0.264796 -0.205622 0.126198 -0.230303 -0.209527 -0.125246 0.275232 0.323217 0.133385 -0.160142 -0.183147 -0.149865 -0.191590 -0.116751 -0.130398 -0.008731 -0.068736 -0.014848 0.543312 0.543813 -0.118405 -0.235403 0.079579 0.083910 0.112933 0.097566 0.082831 0.112885 0.069560 0.077019 0.092826 0.090028 0.077286 0.077972 0.084973 0.102499 0.130057 0.105494 0.128408 0.129658 0.120673 0.085297 0.098326 0.064118 0.058942 0.083648 0.065609 0.095465
qa: -0.1794 -0.1758 -0.1769 -0.1729 -0.1751 -0.1702 -0.2767 -0.2446 -0.2760 -0.0469 -0.2970 0.1549 0.0975 -0.2648 -0.2056 0.1262 -0.2303 -0.2095 -0.1252 0.2752 0.3232 0.1334 -0.1601 -0.1831 -0.1499 -0.1916 -0.1168 -0.1304 -0.0087 -0.0687 -0.0148 0.5433 0.5438 -0.1184 -0.2354 0.0796 0.0839 0.1129 0.0976 0.0828 0.1129 0.0696 0.0770 0.0928 0.0900 0.0773 0.0780 0.0850 0.1025 0.1301 0.1055 0.1284 0.1297 0.1207 0.0853 0.0983 0.0641 0.0589 0.0836 0.0656 0.0955
va: 1.1193 1.1188 1.1260 1.1328 1.1240 1.1211 2.1288 2.1234 2.1281 2.7873 3.0808 3.9212 3.9393 3.9050 3.9729 3.8776 3.9560 3.9665 3.8939 3.9840 4.1068 4.0745 3.9061 3.9482 3.9313 4.0862 3.9064 4.0516 4.1144 3.6731 3.8844 4.4446 4.4388 3.9610 3.9214 1.0055 1.0039 1.0310 1.0135 1.0201 1.0296 1.0044 1.0157 1.0132 1.0127 1.0165 1.0065 1.0117 1.0192 1.0346 1.0373 1.0163 1.0171 1.0133 0.9851 0.9897 1.0143 1.0103 1.0065 1.0062 1.0128
dispcorr: -0.031354946 hartree
energy: -1864.686269012004
dipole: 12.45224 -12.80840 -0.35615 19.25685 -18.51262 0.74423 9.17347 -7.89413 1.27934
magnitude: 1.52231 au
magnitude: 3.86941 debye
