program: Orca
programVersion: 5.0.2
elementType: F F F F F F O O O N N C C C C C C C C C C C C C C C C C C C C C C C C H H H H H H H H H H H H H H H H H H H H H H H H H H
charge: 0
multiplicity: 1
keywords: wb97x-d3
keywords: def2-TZVPP
keywords: def2/J RIJCOSX
keywords: DEFGRID2
keywords: scfconv7
keywords: smallprint printgap noloewdin
keywords: NOSOSCF
formula: C24H26F6N2O3
InChI: InChI=1/C24H26F6N2O3/c1-2-10-33-21-11-15(23(25,26)27)6-8-20(21)34-19-12-17-4-3-5-18(13-19)32(17)35-22-9-7-16(14-31-22)24(28,29)30/h6-9,11,14,17-19H,2-5,10,12-13H2,1H3
61 atoms
F  7.781673 -0.916819 0.056204
F  6.851942 -2.848274 -0.002131
F  7.197614 -1.773316 -1.833962
F  -8.64659 0.19429 0.55145
F  -8.2321 -1.912902 0.566905
F  -8.011003 -0.76741 2.373603
O  1.759776 0.683914 0.193193
O  -2.469896 0.197153 -0.073625
O  3.281729 0.323265 2.209532
N  -2.122392 0.709551 -1.337835
N  -4.092265 -0.432318 1.294837
C  -1.473257 2.004672 -1.142679
C  -1.207034 -0.231613 -1.977987
C  -0.192157 1.905685 -0.304066
C  0.093161 -0.430291 -1.18542
C  0.800105 0.8787 -0.834241
C  -1.306972 2.612218 -2.538766
C  -1.033802 0.258828 -3.418579
C  -0.566546 1.709396 -3.524549
C  2.948194 0.129703 -0.085259
C  -3.792448 0.005452 0.091154
C  3.798396 -0.053371 1.029354
C  3.395245 -0.246952 -1.340293
C  -4.748414 0.241882 -0.899887
C  5.04985 -0.606835 0.845988
C  4.658721 -0.804523 -1.514146
C  5.482779 -0.988575 -0.425671
C  -6.066576 0.00445 -0.577091
C  -5.361107 -0.655958 1.58996
C  -6.399875 -0.450519 0.694847
C  4.129111 0.506615 3.325907
C  6.826516 -1.628629 -0.55858
C  -7.821136 -0.733837 1.052041
C  5.009146 1.74191 3.212614
C  4.217798 3.016859 2.95894
H  -2.178105 2.639915 -0.599828
H  -1.716299 -1.197604 -2.025186
H  -0.461521 1.627725 0.717491
H  0.280984 2.888825 -0.245215
H  0.750126 -1.100023 -1.74543
H  -0.141635 -0.9446 -0.250288
H  1.30917 1.290452 -1.710113
H  -0.806293 3.579029 -2.453451
H  -2.308847 2.81455 -2.925802
H  -2.002899 0.160455 -3.914132
H  -0.346753 -0.406102 -3.946659
H  0.511241 1.778832 -3.373354
H  -0.734424 2.070307 -4.54123
H  2.77202 -0.113309 -2.213141
H  -4.464917 0.600992 -1.876101
H  5.705406 -0.751299 1.694018
H  4.972782 -1.085828 -2.50878
H  -6.8323 0.182237 -1.321029
H  -5.551266 -1.009459 2.596472
H  4.731292 -0.388574 3.520853
H  3.447543 0.614749 4.171042
H  5.565488 1.826773 4.150415
H  5.760789 1.610062 2.430312
H  3.682453 2.976048 2.01122
H  3.481025 3.190956 3.744858
H  4.878153 3.882952 2.928116
totalener: -1864.65214782 hartree
nucrepener: 3782.18508784 hartree
electener: -5646.83723567 hartree
twoeener: 4435.72036831 hartree
kineticenergy: 1857.39312299 hartree
xcener: -168.792702346273 hartree
chargesum: -0.0000000
charge: -0.180212 -0.174814 -0.177034 -0.175642 -0.169421 -0.172979 -0.274838 -0.244854 -0.283514 -0.049170 -0.296516 0.100205 0.160164 -0.201310 -0.267463 0.126910 -0.211619 -0.232446 -0.126145 0.321929 0.322533 0.074988 -0.173399 -0.180727 -0.165152 -0.188486 -0.098612 -0.129055 -0.009033 -0.069560 -0.015488 0.543629 0.542823 -0.129300 -0.229419 0.081568 0.081416 0.111206 0.081926 0.098244 0.113494 0.065319 0.076499 0.091258 0.092688 0.077540 0.078551 0.085151 0.104290 0.128842 0.109228 0.128620 0.130164 0.119911 0.088714 0.105400 0.068783 0.075016 0.082180 0.071681 0.085340
qa: -0.1802 -0.1748 -0.1770 -0.1756 -0.1694 -0.1730 -0.2748 -0.2449 -0.2835 -0.0492 -0.2965 0.1002 0.1602 -0.2013 -0.2675 0.1269 -0.2116 -0.2324 -0.1261 0.3219 0.3225 0.0750 -0.1734 -0.1807 -0.1652 -0.1885 -0.0986 -0.1291 -0.0090 -0.0696 -0.0155 0.5436 0.5428 -0.1293 -0.2294 0.0816 0.0814 0.1112 0.0819 0.0982 0.1135 0.0653 0.0765 0.0913 0.0927 0.0775 0.0786 0.0852 0.1043 0.1288 0.1092 0.1286 0.1302 0.1199 0.0887 0.1054 0.0688 0.0750 0.0822 0.0717 0.0853
va: 1.1188 1.1201 1.1259 1.1232 1.1213 1.1318 2.1338 2.1232 2.1119 2.7915 3.0809 3.9521 3.9147 3.9585 3.9078 3.8925 3.9624 3.9598 3.8962 3.9104 4.1060 4.0765 3.9306 3.9489 3.9269 4.0839 3.8611 4.0462 4.1191 3.6736 3.9213 4.4456 4.4373 3.8931 3.9282 1.0062 1.0035 1.0329 1.0190 1.0133 1.0321 1.0042 1.0163 1.0129 1.0120 1.0159 1.0054 1.0113 1.0192 1.0352 1.0303 1.0165 1.0169 1.0134 0.9968 0.9939 1.0159 1.0072 1.0131 1.0055 1.0057
dispcorr: -0.032191715 hartree
energy: -1864.684339539531
dipole: 22.11762 -22.20817 -0.09055 32.69022 -31.40170 1.28852 -8.57705 7.47376 -1.10329
magnitude: 1.69874 au
magnitude: 4.31785 debye
