program: Orca
programVersion: 5.0.2
elementType: F F F F F F O O O N N C C C C C C C C C C C C C C C C C C C C C C C C H H H H H H H H H H H H H H H H H H H H H H H H H H
charge: 0
multiplicity: 1
keywords: wb97x-d3
keywords: def2-TZVPP
keywords: def2/J RIJCOSX
keywords: DEFGRID2
keywords: scfconv7
keywords: smallprint printgap noloewdin
keywords: NOSOSCF
formula: C24H26F6N2O3
InChI: InChI=1/C24H26F6N2O3/c1-2-10-33-21-11-15(23(25,26)27)6-8-20(21)34-19-12-17-4-3-5-18(13-19)32(17)35-22-9-7-16(14-31-22)24(28,29)30/h6-9,11,14,17-19H,2-5,10,12-13H2,1H3
61 atoms
F  7.425688 -2.131256 -0.072135
F  6.956382 -1.082838 1.743313
F  6.358773 -3.136927 1.501386
F  -8.382822 -0.60605 1.327815
F  -8.427274 -0.954027 -0.791057
F  -7.963815 -2.571189 0.548804
O  1.710153 -0.227175 -1.576698
O  -2.3665 -0.170803 -0.236391
O  3.766346 1.52882 -1.231993
N  -1.926048 1.151907 -0.037879
N  -4.090298 -1.561755 -0.284383
C  -0.819197 1.127403 0.913482
C  -1.490855 1.696708 -1.323129
C  0.383437 0.31755 0.406268
C  -0.314995 0.921005 -1.930328
C  0.858851 0.753057 -0.975956
C  -0.531571 2.590891 1.263837
C  -1.252029 3.190434 -1.086374
C  -0.275025 3.483356 0.050229
C  2.840566 -0.599941 -0.935964
C  -3.689119 -0.331321 -0.044644
C  3.930571 0.276248 -0.767357
C  2.954159 -1.907778 -0.498894
C  -4.550732 0.690192 0.3619
C  5.092093 -0.196392 -0.176532
C  4.117445 -2.377546 0.095043
C  5.184659 -1.515301 0.259867
C  -5.885032 0.376328 0.502805
C  -5.372739 -1.848305 -0.143524
C  -6.32462 -0.918043 0.247078
C  4.757254 2.511029 -0.999678
C  6.47745 -1.972436 0.860989
C  -7.773287 -1.266343 0.335858
C  4.820022 3.001295 0.440041
C  3.48109 3.481394 0.978898
H  -1.184905 0.644791 1.823287
H  -2.336377 1.613891 -2.011486
H  0.097803 -0.737154 0.364278
H  1.193952 0.389021 1.137353
H  0.013913 1.417302 -2.846489
H  -0.665826 -0.071929 -2.221833
H  1.409027 1.690299 -0.899871
H  0.31189 2.636273 1.956683
H  -1.400339 2.969986 1.807812
H  -2.220134 3.641142 -0.853126
H  -0.908312 3.65312 -2.013958
H  0.75265 3.37283 -0.295269
H  -0.367037 4.530257 0.347074
H  2.111921 -2.570881 -0.646635
H  -4.184206 1.684542 0.559475
H  5.94463 0.457159 -0.056205
H  4.168312 -3.405038 0.425132
H  -6.577814 1.145924 0.816726
H  -5.647418 -2.876053 -0.350828
H  4.478452 3.338103 -1.654577
H  5.739949 2.160472 -1.336095
H  5.222293 2.230463 1.100489
H  5.544709 3.81993 0.461285
H  3.594549 3.901435 1.977703
H  3.045077 4.254285 0.343616
H  2.762612 2.66434 1.050995
totalener: -1864.65033703 hartree
nucrepener: 3850.45623756 hartree
electener: -5715.10657459 hartree
twoeener: 4503.90021549 hartree
kineticenergy: 1857.38819302 hartree
xcener: -168.791097742022 hartree
chargesum: -0.0000000
charge: -0.172263 -0.180887 -0.173794 -0.175731 -0.169265 -0.173008 -0.319219 -0.244084 -0.294959 -0.051128 -0.297430 0.196189 0.088466 -0.277631 -0.204100 0.165639 -0.261609 -0.205316 -0.110124 0.047156 0.323882 0.301053 -0.088348 -0.182645 -0.203895 -0.167496 -0.086548 -0.129748 -0.010927 -0.068182 -0.017002 0.543844 0.541255 -0.118621 -0.238438 0.079964 0.083415 0.107577 0.092864 0.082758 0.104229 0.051899 0.080201 0.095806 0.090286 0.076179 0.055428 0.083587 0.125887 0.129995 0.107327 0.130971 0.131385 0.118793 0.104928 0.097060 0.080696 0.074554 0.101150 0.079807 0.048165
qa: -0.1723 -0.1809 -0.1738 -0.1757 -0.1693 -0.1730 -0.3192 -0.2441 -0.2950 -0.0511 -0.2974 0.1962 0.0885 -0.2776 -0.2041 0.1656 -0.2616 -0.2053 -0.1101 0.0472 0.3239 0.3011 -0.0883 -0.1826 -0.2039 -0.1675 -0.0865 -0.1297 -0.0109 -0.0682 -0.0170 0.5438 0.5413 -0.1186 -0.2384 0.0800 0.0834 0.1076 0.0929 0.0828 0.1042 0.0519 0.0802 0.0958 0.0903 0.0762 0.0554 0.0836 0.1259 0.1300 0.1073 0.1310 0.1314 0.1188 0.1049 0.0971 0.0807 0.0746 0.1012 0.0798 0.0482
va: 1.1227 1.1182 1.1309 1.1241 1.1201 1.1309 2.0933 2.1252 2.0956 2.8028 3.0805 3.9368 3.9747 3.9181 3.9723 3.8777 3.9705 3.9638 3.9145 4.0472 4.1050 3.8017 3.9640 3.9499 3.9990 4.0250 3.8448 4.0405 4.1273 3.6700 3.8940 4.4409 4.4385 3.8639 3.9349 1.0038 1.0038 1.0300 1.0105 1.0190 1.0349 1.0058 1.0117 1.0149 1.0127 1.0158 1.0056 1.0116 1.0137 1.0350 1.0343 1.0139 1.0168 1.0136 0.9946 0.9983 1.0074 1.0158 1.0119 1.0003 1.0079
dispcorr: -0.035245376 hartree
energy: -1864.685582403748
dipole: 23.75286 -23.27126 0.48161 49.87375 -47.44383 2.42991 -4.96723 5.14619 0.17897
magnitude: 2.48364 au
magnitude: 6.31291 debye
