program: Orca
programVersion: 5.0.2
elementType: F F F F F F O O O N N C C C C C C C C C C C C C C C C C C C C C C C C H H H H H H H H H H H H H H H H H H H H H H H H H H
charge: 0
multiplicity: 1
keywords: wb97x-d3
keywords: def2-TZVPP
keywords: def2/J RIJCOSX
keywords: DEFGRID2
keywords: scfconv7
keywords: smallprint printgap noloewdin
keywords: NOSOSCF
formula: C24H26F6N2O3
InChI: InChI=1/C24H26F6N2O3/c1-2-10-33-21-11-15(23(25,26)27)6-8-20(21)34-19-12-17-4-3-5-18(13-19)32(17)35-22-9-7-16(14-31-22)24(28,29)30/h6-9,11,14,17-19H,2-5,10,12-13H2,1H3
61 atoms
F  7.736903 -1.628153 -0.261301
F  6.814128 -3.029218 -1.6118
F  7.036086 -0.96474 -2.177202
F  -8.370681 -0.102371 -0.936061
F  -8.126208 -2.058003 -0.070861
F  -8.614134 -0.389196 1.186169
O  1.781025 -0.414322 1.117407
O  -2.476701 0.209752 0.8401
O  3.761571 1.388415 1.070899
N  -1.918401 1.17711 -0.024987
N  -4.35627 0.360076 -0.482505
C  -1.051564 2.030943 0.77702
C  -1.164589 0.515013 -1.083825
C  0.134262 1.277887 1.396212
C  0.015277 -0.311397 -0.54805
C  0.933224 0.47643 0.381592
C  -0.6871 3.211771 -0.129644
C  -0.803783 1.615596 -2.08567
C  -0.065489 2.799563 -1.463289
C  2.960433 -0.74118 0.545907
C  -3.786312 -0.001283 0.641679
C  4.020647 0.186962 0.530333
C  3.157165 -2.001854 0.017242
C  -4.466529 -0.646858 1.681575
C  5.236584 -0.179462 -0.020585
C  4.380632 -2.371193 -0.531948
C  5.412958 -1.454796 -0.555864
C  -5.807592 -0.888573 1.513785
C  -5.65374 0.126138 -0.630521
C  -6.433472 -0.487889 0.331868
C  4.783006 2.363523 1.098691
C  6.747127 -1.77875 -1.152048
C  -7.886677 -0.754662 0.123009
C  4.20925 3.640663 1.673214
C  3.099376 4.240282 0.823312
H  -1.657865 2.432295 1.593063
H  -1.852309 -0.16227 -1.594696
H  -0.245326 0.589408 2.156063
H  0.791375 1.97915 1.916484
H  0.582449 -0.720662 -1.388794
H  -0.380759 -1.165553 0.007709
H  1.562442 1.148264 -0.204638
H  -0.024138 3.891924 0.409768
H  -1.610079 3.762995 -0.322962
H  -1.742467 1.96691 -2.519781
H  -0.218986 1.18593 -2.901967
H  0.993801 2.570133 -1.338819
H  -0.094957 3.646768 -2.151645
H  2.339481 -2.709827 0.052663
H  -3.948232 -0.928142 2.587436
H  6.062355 0.518759 -0.032188
H  4.502913 -3.365702 -0.935735
H  -6.367685 -1.373083 2.303099
H  -6.08022 0.449539 -1.572132
H  5.16396 2.550415 0.085907
H  5.624239 2.012997 1.708959
H  3.853808 3.454082 2.689305
H  5.033013 4.353335 1.762315
H  2.243233 3.57034 0.753529
H  2.747505 5.181046 1.245736
H  3.443914 4.444119 -0.19206
totalener: -1864.65169612 hartree
nucrepener: 3827.48404584 hartree
electener: -5692.13574196 hartree
twoeener: 4481.33753009 hartree
kineticenergy: 1857.40952146 hartree
xcener: -168.791221735624 hartree
chargesum: -0.0000000
charge: -0.176586 -0.174278 -0.176662 -0.173453 -0.170492 -0.174804 -0.333193 -0.288311 -0.282229 -0.001720 -0.310763 0.183838 0.112554 -0.256866 -0.240294 0.199454 -0.264881 -0.215154 -0.126811 0.075038 0.402257 0.285764 -0.102308 -0.234533 -0.200945 -0.153004 -0.100587 -0.076426 -0.012887 -0.099455 -0.007922 0.548494 0.542273 -0.129186 -0.184484 0.076479 0.085632 0.101372 0.086175 0.083264 0.094199 0.046706 0.076535 0.100122 0.099448 0.072068 0.068525 0.080902 0.127935 0.127587 0.103086 0.133410 0.131376 0.117921 0.083446 0.103663 0.070517 0.068634 0.006301 0.093891 0.079367
qa: -0.1766 -0.1743 -0.1767 -0.1735 -0.1705 -0.1748 -0.3332 -0.2883 -0.2822 -0.0017 -0.3108 0.1838 0.1126 -0.2569 -0.2403 0.1995 -0.2649 -0.2152 -0.1268 0.0750 0.4023 0.2858 -0.1023 -0.2345 -0.2009 -0.1530 -0.1006 -0.0764 -0.0129 -0.0995 -0.0079 0.5485 0.5423 -0.1292 -0.1845 0.0765 0.0856 0.1014 0.0862 0.0833 0.0942 0.0467 0.0765 0.1001 0.0994 0.0721 0.0685 0.0809 0.1279 0.1276 0.1031 0.1334 0.1314 0.1179 0.0834 0.1037 0.0705 0.0686 0.0063 0.0939 0.0794
va: 1.1228 1.1313 1.1209 1.1317 1.1215 1.1238 2.0524 2.1259 2.1168 2.8031 3.0623 3.9061 3.9592 3.9648 3.9594 3.8067 3.9787 3.9796 3.9085 4.0838 3.9761 3.8550 3.9542 4.0485 4.0049 3.9804 3.8890 4.0107 4.1339 3.6922 3.8802 4.4386 4.4416 3.9567 3.9105 1.0047 1.0135 1.0343 1.0171 1.0160 1.0315 0.9982 1.0084 1.0173 1.0141 1.0134 1.0012 1.0132 1.0083 1.0119 1.0402 1.0127 1.0130 1.0105 0.9865 0.9901 1.0140 1.0122 1.0215 1.0099 1.0094
dispcorr: -0.034020663 hartree
energy: -1864.685716782217
dipole: 22.61963 -22.22924 0.39038 42.37957 -41.17830 1.20127 7.04165 -6.56461 0.47704
magnitude: 1.35019 au
magnitude: 3.43191 debye
