program: Orca
programVersion: 5.0.2
elementType: F F F F F F O O O N N C C C C C C C C C C C C C C C C C C C C C C C C H H H H H H H H H H H H H H H H H H H H H H H H H H
charge: 0
multiplicity: 1
keywords: wb97x-d3
keywords: def2-TZVPP
keywords: def2/J RIJCOSX
keywords: DEFGRID2
keywords: scfconv7
keywords: smallprint printgap noloewdin
keywords: NOSOSCF
formula: C24H26F6N2O3
InChI: InChI=1/C24H26F6N2O3/c1-2-10-33-21-11-15(23(25,26)27)6-8-20(21)34-19-12-17-4-3-5-18(13-19)32(17)35-22-9-7-16(14-31-22)24(28,29)30/h6-9,11,14,17-19H,2-5,10,12-13H2,1H3
61 atoms
F  6.77882 -1.428738 -2.075884
F  7.347096 -2.415276 -0.25605
F  6.108888 -3.438989 -1.681327
F  -8.237957 -0.64717 -1.394897
F  -7.87727 -2.606676 -0.573575
F  -8.418116 -0.973468 0.719037
O  1.847192 -0.275428 1.656996
O  -2.30701 -0.207059 0.386354
O  3.592714 1.51184 0.435803
N  -1.8902 1.137061 0.363378
N  -4.002524 -1.624184 0.223151
C  -1.439486 1.510904 1.702712
C  -0.801372 1.265361 -0.600588
C  -0.235578 0.687175 2.175652
C  0.435891 0.434825 -0.225466
C  0.924883 0.712702 1.191068
C  -1.235287 3.028898 1.667735
C  -0.559701 2.770203 -0.761219
C  -0.303283 3.506854 0.55409
C  2.89864 -0.680999 0.916109
C  -3.628883 -0.363769 0.183146
C  3.827243 0.189807 0.315876
C  3.104068 -2.048037 0.811659
C  -4.516029 0.692275 -0.043778
C  4.920506 -0.337365 -0.355922
C  4.201939 -2.572063 0.149415
C  5.111179 -1.712291 -0.44021
C  -5.843408 0.375281 -0.229233
C  -5.280414 -1.913363 0.043315
C  -6.253817 -0.953811 -0.18769
C  4.413866 2.428232 -0.257228
C  6.333307 -2.249208 -1.115874
C  -7.694851 -1.301743 -0.360256
C  3.807997 3.810254 -0.121597
C  4.637878 4.857864 -0.849344
H  -2.268308 1.315326 2.3885
H  -1.17304 0.894902 -1.559182
H  -0.552149 -0.348932 2.318321
H  0.092175 1.051107 3.152584
H  1.223837 0.632249 -0.956857
H  0.185105 -0.62602 -0.313677
H  1.414276 1.682641 1.231739
H  -0.871483 3.366612 2.640415
H  -2.219243 3.48421 1.529128
H  -1.448326 3.190562 -1.238572
H  0.269593 2.929017 -1.454548
H  0.738525 3.398221 0.855325
H  -0.446683 4.578446 0.400398
H  2.381415 -2.706646 1.274924
H  -4.172458 1.713432 -0.078463
H  5.641951 0.325924 -0.811374
H  4.325768 -3.64432 0.092195
H  -6.55566 1.169832 -0.411024
H  -5.531016 -2.966659 0.084036
H  4.485257 2.156618 -1.318408
H  5.431909 2.417135 0.15245
H  2.792262 3.79657 -0.526122
H  3.723375 4.067593 0.936818
H  4.714132 4.639332 -1.915473
H  4.191559 5.846248 -0.750433
H  5.651649 4.915714 -0.450935
totalener: -1864.65206729 hartree
nucrepener: 3820.10539450 hartree
electener: -5684.75746179 hartree
twoeener: 4473.50334777 hartree
kineticenergy: 1857.38548002 hartree
xcener: -168.789378042217 hartree
chargesum: -0.0000000
charge: -0.180610 -0.171338 -0.174992 -0.175344 -0.172945 -0.170771 -0.320549 -0.244328 -0.298421 -0.049334 -0.296463 0.089787 0.151154 -0.197998 -0.254763 0.161484 -0.204322 -0.232269 -0.123602 0.071114 0.324315 0.291121 -0.131660 -0.183399 -0.176754 -0.152801 -0.093852 -0.131142 -0.008255 -0.070892 0.025426 0.534848 0.544337 -0.107947 -0.256664 0.081838 0.078947 0.101403 0.082333 0.090130 0.109950 0.073963 0.076608 0.090184 0.095747 0.074599 0.064264 0.084453 0.123586 0.129821 0.114464 0.126375 0.128951 0.121070 0.079567 0.088706 0.043518 0.076637 0.078106 0.090500 0.082104
qa: -0.1806 -0.1713 -0.1750 -0.1753 -0.1729 -0.1708 -0.3205 -0.2443 -0.2984 -0.0493 -0.2965 0.0898 0.1512 -0.1980 -0.2548 0.1615 -0.2043 -0.2323 -0.1236 0.0711 0.3243 0.2911 -0.1317 -0.1834 -0.1768 -0.1528 -0.0939 -0.1311 -0.0083 -0.0709 0.0254 0.5348 0.5443 -0.1079 -0.2567 0.0818 0.0789 0.1014 0.0823 0.0901 0.1100 0.0740 0.0766 0.0902 0.0957 0.0746 0.0643 0.0845 0.1236 0.1298 0.1145 0.1264 0.1290 0.1211 0.0796 0.0887 0.0435 0.0766 0.0781 0.0905 0.0821
va: 1.1194 1.1201 1.1270 1.1230 1.1325 1.1211 2.1056 2.1242 2.0976 2.7907 3.0806 3.9719 3.9599 3.9704 3.9301 3.8384 3.9716 3.9543 3.9087 4.0920 4.1075 3.8017 4.0017 3.9494 3.9375 4.0427 3.8696 4.0542 4.1130 3.6728 3.8650 4.4429 4.4386 3.9287 3.9631 1.0044 1.0047 1.0348 1.0201 1.0153 1.0265 1.0127 1.0159 1.0120 1.0136 1.0137 1.0089 1.0104 1.0163 1.0348 1.0361 1.0146 1.0173 1.0130 0.9888 0.9872 1.0076 1.0061 1.0029 1.0054 1.0045
dispcorr: -0.033561702 hartree
energy: -1864.685628990013
dipole: 25.03013 -24.73399 0.29614 55.61678 -53.05021 2.56657 9.74173 -9.68650 0.05523
magnitude: 2.58419 au
magnitude: 6.56848 debye
