program: Orca
programVersion: 5.0.2
elementType: F F F F F F O O O N N C C C C C C C C C C C C C C C C C C C C C C C C H H H H H H H H H H H H H H H H H H H H H H H H H H
charge: 0
multiplicity: 1
keywords: wb97x-d3
keywords: def2-TZVPP
keywords: def2/J RIJCOSX
keywords: DEFGRID2
keywords: scfconv7
keywords: smallprint printgap noloewdin
keywords: NOSOSCF
formula: C24H26F6N2O3
InChI: InChI=1/C24H26F6N2O3/c1-2-10-33-21-11-15(23(25,26)27)6-8-20(21)34-19-12-17-4-3-5-18(13-19)32(17)35-22-9-7-16(14-31-22)24(28,29)30/h6-9,11,14,17-19H,2-5,10,12-13H2,1H3
61 atoms
F  6.522223 -2.969069 0.111069
F  6.591695 -2.514226 -1.99462
F  7.550334 -1.215056 -0.569776
F  -7.984396 -1.206009 0.106328
F  -6.875602 -2.683373 1.209653
F  -7.683213 -0.975433 2.23149
O  1.828531 1.106093 -0.009764
O  -2.329241 1.247736 0.072351
O  3.224961 0.41506 2.006381
N  -2.083513 1.650292 -1.261169
N  -4.270396 0.289238 -0.72164
C  -1.256114 2.848952 -1.173946
C  -1.370518 0.584406 -1.961994
C  0.074928 2.601932 -0.451572
C  -0.035588 0.220509 -1.295487
C  0.866186 1.422315 -1.006334
C  -1.138842 3.397731 -2.598831
C  -1.283241 1.025465 -3.4242
C  -0.611106 2.38265 -3.610044
C  2.896849 0.351602 -0.296619
C  -3.506977 0.649712 0.282132
C  3.680853 -0.014882 0.821463
C  3.28587 -0.067816 -1.555953
C  -3.82663 0.410784 1.624929
C  4.821778 -0.768186 0.638346
C  4.438269 -0.830378 -1.731968
C  5.203223 -1.179884 -0.64118
C  -5.006524 -0.234903 1.894828
C  -5.41283 -0.32691 -0.445946
C  -5.834845 -0.616853 0.838361
C  3.958312 0.116459 3.173557
C  6.462334 -1.970445 -0.781407
C  -7.097777 -1.367193 1.093269
C  3.239986 0.738635 4.353064
C  3.118221 2.252799 4.258532
H  -1.817354 3.586279 -0.59444
H  -2.008854 -0.301202 -1.940202
H  -0.128912 2.407024 0.603546
H  0.684205 3.508208 -0.485227
H  0.480047 -0.518835 -1.913205
H  -0.244451 -0.273488 -0.34315
H  1.388603 1.736266 -1.914616
H  -0.51222 4.292296 -2.587059
H  -2.136863 3.71858 -2.906341
H  -2.30604 1.074829 -3.804836
H  -0.769058 0.255479 -4.00358
H  0.473537 2.289471 -3.533673
H  -0.796755 2.747951 -4.622104
H  2.702385 0.190154 -2.428582
H  -3.160235 0.728846 2.41413
H  5.424081 -1.05395 1.48972
H  4.711832 -1.140755 -2.730118
H  -5.285552 -0.43431 2.920872
H  -6.013144 -0.600618 -1.305518
H  4.978123 0.517333 3.098519
H  4.040751 -0.969576 3.308609
H  2.250616 0.285334 4.451586
H  3.794495 0.462874 5.253652
H  2.52632 2.551963 3.394987
H  2.639708 2.660624 5.148626
H  4.098927 2.723464 4.168659
totalener: -1864.65362881 hartree
nucrepener: 3802.95496157 hartree
electener: -5667.60859039 hartree
twoeener: 4456.73725735 hartree
kineticenergy: 1857.41282363 hartree
xcener: -168.794587612107 hartree
chargesum: -0.0000000
charge: -0.180197 -0.176609 -0.175381 -0.173138 -0.168807 -0.175393 -0.277199 -0.282359 -0.276419 0.009950 -0.319842 0.094022 0.132669 -0.198138 -0.256238 0.114886 -0.205908 -0.230783 -0.134438 0.256776 0.404253 0.147734 -0.152468 -0.236939 -0.156517 -0.192996 -0.109572 -0.075421 -0.013027 -0.096316 -0.012522 0.542071 0.539628 -0.118967 -0.237228 0.080110 0.092411 0.101610 0.082552 0.097530 0.103866 0.069396 0.071572 0.094044 0.100619 0.072781 0.073733 0.082737 0.105711 0.127241 0.105810 0.128024 0.134189 0.116500 0.087678 0.096751 0.063049 0.060073 0.092174 0.083198 0.067475
qa: -0.1802 -0.1766 -0.1754 -0.1731 -0.1688 -0.1754 -0.2772 -0.2824 -0.2764 0.0100 -0.3198 0.0940 0.1327 -0.1981 -0.2562 0.1149 -0.2059 -0.2308 -0.1344 0.2568 0.4043 0.1477 -0.1525 -0.2369 -0.1565 -0.1930 -0.1096 -0.0754 -0.0130 -0.0963 -0.0125 0.5421 0.5396 -0.1190 -0.2372 0.0801 0.0924 0.1016 0.0826 0.0975 0.1039 0.0694 0.0716 0.0940 0.1006 0.0728 0.0737 0.0827 0.1057 0.1272 0.1058 0.1280 0.1342 0.1165 0.0877 0.0968 0.0630 0.0601 0.0922 0.0832 0.0675
va: 1.1187 1.1263 1.1183 1.1308 1.1202 1.1249 2.1307 2.1373 2.1248 2.7851 3.0553 3.9732 3.8717 3.9643 3.8718 3.8857 3.9641 3.9864 3.9106 3.9944 3.9761 4.0624 3.9033 4.0431 3.9401 4.0871 3.8975 3.9927 4.1410 3.6837 3.8832 4.4436 4.4411 3.9642 3.9224 1.0071 1.0106 1.0321 1.0185 1.0141 1.0307 1.0005 1.0140 1.0143 1.0144 1.0139 1.0055 1.0124 1.0174 1.0122 1.0379 1.0165 1.0130 1.0105 0.9856 0.9897 1.0141 1.0109 1.0124 1.0057 1.0064
dispcorr: -0.031124962 hartree
energy: -1864.684753775065
dipole: 15.75445 -15.88236 -0.12791 38.49901 -37.32315 1.17586 -0.04706 0.25182 0.20475
magnitude: 1.20039 au
magnitude: 3.05114 debye
