program: Gaussian 09
title: 000006630
version: EM64L-G09RevD.01
frameworkgroup: C1[X(C7H8O3S)]
method: RPBEPBE
basis: SDD
operation: Freq
keyword: #pfreq=noraman
keyword: PBEPBE/SDD
title: #p freq=noraman PBEPBE/SDD
converged: NO YES NO NO
title: Mulliken charges:
elementType: S O O O C C C C C C C H H H H H H H H
charge: 0.983693 -0.395617 -0.511442 -0.511537 -0.018880 -0.244213 -0.243864 -0.198401 -0.198420 -0.212994 -0.483279 0.285829 0.285753 0.245027 0.245023 0.240471 0.243135 0.243080 0.246636
chargesum: 0.00000
title: Mulliken charges with hydrogens summed into heavy atoms:
elementType: S O O O C C C C C C C
charge: 0.983693 -0.395617 -0.511442 -0.511537 -0.018880 0.041616 0.041890 0.046626 0.046603 0.027477 0.249572
polarizability: 1.45876314e+02 6.03710144e-04 1.07775013e+02 -2.93363777e+00 4.02739278e-02 7.16865342e+01
1716.lowfreq: -13.6478 -0.0012 0.0012 0.0012 7.7149 9.9188 21.3900 49.2150 77.6360
frequency: 18.9140 48.9492 77.6263 111.8334 140.3811 175.5075 245.8953 248.4212 255.7457 348.9981 358.5415 404.6896 453.9766 482.3877 532.5711 601.3678 661.6537 688.4509 760.7584 829.6488 850.1097 922.7560 936.2890 953.6140 977.1560 985.3830 1006.2864 1008.7596 1049.8944 1078.5086 1108.6547 1109.8945 1174.3538 1178.9974 1305.0223 1384.5779 1407.1261 1437.9287 1440.0286 1452.1607 1473.6616 1576.4801 1605.4224 2976.2969 3083.3007 3105.4701 3141.2022 3152.9527 3161.3011 3170.5683 3178.9641
redmass: 3.1393 4.9467 4.6673 1.0875 6.6718 4.9177 8.1908 4.6836 7.3823 9.1185 8.7104 2.8244 4.6858 7.6857 7.7355 6.4812 7.1062 2.4179 1.4179 16.2527 1.2421 8.3226 1.3643 16.4710 6.2732 1.3912 1.3477 3.9404 2.1969 1.5549 1.3472 1.2573 1.0555 1.1231 1.2959 8.1694 1.1205 1.8902 1.1571 2.0216 1.0559 5.8189 6.9705 1.0280 1.1060 1.1028 1.0861 1.0888 1.0929 1.0971 1.1016
irintensity: 5.4353 1.2213 1.8417 0.0106 1.8433 11.7567 8.0830 2.5774 7.3817 4.8715 4.2793 0.0033 4.8835 69.7750 148.0095 0.0040 8.4814 37.0981 73.9152 78.0934 0.3903 72.2863 4.5835 86.9855 1.6933 0.0207 0.1537 1.0056 21.4878 2.9517 11.6946 0.0696 0.0084 4.9613 3.3395 6.8410 0.9081 29.2084 4.0204 13.1534 24.3682 1.0602 0.2630 41.5181 23.4144 10.0769 1.4425 10.9718 1.3096 1.9645 22.7994
temp: 298.150 k
press: 1.00000 atm
elementType: 16 8 8 8 6 6 6 6 6 6 6 1 1 1 1 1 1 1 1
symmnumber: 1
zpe: 357919.3 jmol-1
zpe.correction: 0.136324 hartree
zpe.thermalcorrener: 0.147946 hartree
zpe.thermalcorrenthalpy: 0.148891 hartree
zpe.thermalcorrgfe: 0.096917 hartree
zpe.sumelectzpe: -894.265960 hartree
zpe.sumelectthermal: -894.254338 hartree
zpe.sumelectthermalent: -894.253394 hartree
zpe.sumelectthermalfe: -894.305367 hartree
dipole: -3.3652 -0.0076 2.7492
dipole: 4.3455
quadrupole: -55.6781 -70.4308 -78.7728
quadrupole: -0.0225 6.5554 0.0040
quadrupole: 12.6158 -2.1369 -10.4789 -0.0225 6.5554 0.0040
hfenergy: -894.4022847 hartree
pointgroup: C01 [X(C7H8O3S1)]
dipole: -1.2997661 0.005133 1.1106051 debye
dipolederiv: 1.8821005 -0.000721 -0.0059068 0.0000289 1.1830931 0.0016006 0.2693103 0.0013434 1.5467737 -0.958681 -0.000308 -0.1508046 -0.0004626 -0.4333157 -0.0009538 -0.2795136 -0.0006394 -0.6754687 -0.6713277 0.0384579 0.046292 0.0115256 -0.585613 -0.1498389 -0.0294593 -0.0490191 -0.5553778 -0.6713479 -0.0380798 0.0469525 -0.0113501 -0.5843776 0.1498312 -0.0293564 0.0490737 -0.5566067 0.0637802 -0.00022 -0.0139896 0.0000006 -0.0666533 -0.0005492 0.0446996 -0.0007157 -0.1793753 -0.1882503 0.1371854 -0.0027925 -0.1976208 -0.0414627 0.0299746 0.0090793 -0.0435819 -0.0857134 -0.1879908 -0.1368382 -0.0015896 0.1977567 -0.0412662 -0.0303982 0.0074027 0.0433165 -0.0856887 -0.0533582 -0.1613289 -0.0193521 -0.0407452 0.0683332 0.0087356 -0.023948 0.0336216 -0.1231624 -0.0530038 0.1613845 -0.0208718 0.0407567 0.0674769 -0.0104835 -0.0243063 -0.0353849 -0.1227277 0.1463407 -0.0004145 -0.060775 -0.0004402 -0.0006025 -0.0004828 -0.0555413 -0.000504 -0.116411 0.6197779 0.000823 0.1999538 -0.0000482 0.2455907 -0.0002342 -0.1968871 -0.0003532 0.0515068 0.1231765 -0.063919 0.0189008 -0.0416426 0.0691671 0.0029142 0.0094686 0.0216806 0.151756 0.1231762 0.0639251 0.0183106 0.041718 0.0686188 -0.0021615 0.0090156 -0.0209798 0.1519088 0.0095505 0.0711919 0.0276909 0.0766853 -0.038126 -0.0124894 0.0356019 -0.0127331 0.1575662 0.009256 -0.0710211 0.0283839 -0.0764373 -0.0375712 0.014275 0.0363434 0.0144936 0.1573016 -0.0981268 0.0004367 0.0501516 0.0004387 0.0982386 0.000184 0.0509238 0.0001855 0.1468198 -0.0371811 -0.0335234 -0.0363787 -0.0950779 -0.0558991 0.0610851 0.0974474 0.0863332 0.09577 -0.0366201 0.0331018 -0.0362769 0.0950139 -0.0561298 -0.0609914 0.097633 -0.0861098 0.0961873 -0.021271 -0.0001326 -0.0878986 -0.0000996 0.1404988 -0.0000175 -0.0279138 -0.0000273 -0.0550585 unknown
polarizability: 145.7104027|-0.0715168|107.7743522|-4.5694824|-0.1664599|71.8531064 unknown
InChI: InChI=1S/C7H8O3S/c1-10-11(8,9)7-5-3-2-4-6-7/h2-6H,1H3
charge 0 multiplicity 1
19 atoms
S  1.410743 -0.003537 -0.608208
O  2.023591 0.000731 1.157463
O  1.830444 -1.413162 -1.293178
O  1.834584 1.401121 -1.300831
C  -0.419204 0.000056 -0.192263
C  -1.057828 1.243331 -0.065968
C  -1.060286 -1.240714 -0.054267
C  -2.442203 1.233727 0.222506
C  -2.44463 -1.225629 0.234135
C  -3.128022 0.005427 0.375604
C  3.500438 -0.000002 1.229398
H  -0.50174 2.175703 -0.20357
H  -0.506166 -2.175484 -0.183174
H  -2.979244 2.18176 0.327115
H  -2.983535 -2.171574 0.347671
H  -4.200153 0.007543 0.59928
H  3.924323 0.908559 0.76468
H  3.923489 -0.909351 0.765399
H  3.7101 0.000195 2.312009
