program: Orca
programVersion: 5.0.2
elementType: F F F F F F O O O N N C C C C C C C C C C C C C C C C C C C C C C C C H H H H H H H H H H H H H H H H H H H H H H H H H H
charge: 0
multiplicity: 1
keywords: wb97x-d3
keywords: def2-TZVPP
keywords: def2/J RIJCOSX
keywords: DEFGRID2
keywords: scfconv7
keywords: smallprint printgap noloewdin
keywords: NOSOSCF
formula: C24H26F6N2O3
InChI: InChI=1/C24H26F6N2O3/c1-2-10-33-21-11-15(23(25,26)27)6-8-20(21)34-19-12-17-4-3-5-18(13-19)32(17)35-22-9-7-16(14-31-22)24(28,29)30/h6-9,11,14,17-19H,2-5,10,12-13H2,1H3
61 atoms
F  7.837893 -0.125413 -0.541174
F  7.533737 1.89894 0.132637
F  7.516547 0.267476 1.539326
F  -8.430015 -0.173621 1.934786
F  -8.659293 0.477351 -0.108056
F  -8.233395 -1.585421 0.328642
O  1.62914 -0.232546 -0.421378
O  -2.51208 0.667898 0.367862
O  3.124214 -2.173689 0.318148
N  -2.120296 1.610642 -0.608213
N  -4.622939 0.881424 -0.533462
C  -1.051069 2.415447 -0.032994
C  -1.658769 0.911161 -1.80332
C  0.211714 1.603963 0.298003
C  -0.442206 0.014387 -1.536007
C  0.709342 0.753671 -0.869138
C  -0.843895 3.581228 -1.004366
C  -1.471697 1.994005 -2.870733
C  -0.561193 3.143782 -2.440906
C  2.921302 0.076787 -0.252217
C  -3.834657 0.452631 0.422334
C  3.749424 -0.999503 0.143822
C  3.490933 1.323891 -0.441285
C  -4.287523 -0.274726 1.530321
C  5.102475 -0.791132 0.319353
C  4.857699 1.524274 -0.263874
C  5.662325 0.472935 0.113197
C  -5.634431 -0.522895 1.623083
C  -5.923456 0.639724 -0.429115
C  -6.490438 -0.048046 0.627339
C  3.889659 -3.295453 0.698784
C  7.13415 0.636285 0.308834
C  -7.954823 -0.327056 0.69244
C  2.970805 -4.492512 0.821995
C  3.745599 -5.738828 1.227257
H  -1.429164 2.83938 0.900478
H  -2.479427 0.276317 -2.144131
H  -0.009411 0.931317 1.1306
H  0.992052 2.281711 0.653322
H  -0.105081 -0.43438 -2.473484
H  -0.746694 -0.81229 -0.889247
H  1.206577 1.377155 -1.615948
H  -0.041859 4.223805 -0.633641
H  -1.757865 4.178929 -0.987744
H  -2.464967 2.390318 -3.092619
H  -1.101769 1.536204 -3.790867
H  0.488158 2.870211 -2.561054
H  -0.710879 3.992242 -3.111713
H  2.885544 2.171099 -0.730439
H  -3.594846 -0.615588 2.286788
H  5.741682 -1.610476 0.618755
H  5.264381 2.512161 -0.423947
H  -6.019521 -1.07296 2.471734
H  -6.533613 1.022137 -1.238546
H  4.393618 -3.110005 1.656802
H  4.671017 -3.498551 -0.045956
H  2.193197 -4.277211 1.557956
H  2.464919 -4.658521 -0.131577
H  4.509506 -5.993375 0.490979
H  4.245385 -5.606502 2.188045
H  3.083712 -6.59862 1.320158
totalener: -1864.65349174 hartree
nucrepener: 3749.98874052 hartree
electener: -5614.64223226 hartree
twoeener: 4403.76289950 hartree
kineticenergy: 1857.39982204 hartree
xcener: -168.792711298369 hartree
chargesum: -0.0000000
charge: -0.177626 -0.177151 -0.178549 -0.175018 -0.173255 -0.169388 -0.275476 -0.285742 -0.269209 0.005853 -0.312819 0.164943 0.086170 -0.268897 -0.196331 0.131078 -0.230451 -0.219513 -0.129670 0.277829 0.403192 0.132003 -0.156475 -0.237400 -0.159248 -0.194794 -0.123066 -0.074958 -0.014176 -0.098345 0.010782 0.544976 0.540689 -0.092787 -0.257542 0.076707 0.089672 0.102203 0.095660 0.081214 0.102272 0.063643 0.072540 0.096192 0.100434 0.072592 0.074286 0.082679 0.101562 0.127247 0.103460 0.129742 0.132859 0.117843 0.077984 0.077957 0.064229 0.065001 0.076583 0.076128 0.089685
qa: -0.1776 -0.1772 -0.1785 -0.1750 -0.1733 -0.1694 -0.2755 -0.2857 -0.2692 0.0059 -0.3128 0.1649 0.0862 -0.2689 -0.1963 0.1311 -0.2305 -0.2195 -0.1297 0.2778 0.4032 0.1320 -0.1565 -0.2374 -0.1592 -0.1948 -0.1231 -0.0750 -0.0142 -0.0983 0.0108 0.5450 0.5407 -0.0928 -0.2575 0.0767 0.0897 0.1022 0.0957 0.0812 0.1023 0.0636 0.0725 0.0962 0.1004 0.0726 0.0743 0.0827 0.1016 0.1272 0.1035 0.1297 0.1329 0.1178 0.0780 0.0780 0.0642 0.0650 0.0766 0.0761 0.0897
va: 1.1191 1.1259 1.1191 1.1244 1.1317 1.1210 2.1342 2.1318 2.1357 2.7857 3.0602 3.8995 3.9003 3.9113 3.9344 3.8723 3.9651 3.9899 3.9068 3.9926 3.9760 4.0821 3.9004 4.0495 3.9280 4.0854 3.9160 4.0030 4.1375 3.6895 3.8983 4.4452 4.4417 3.9220 3.9398 1.0055 1.0130 1.0313 1.0134 1.0209 1.0316 1.0077 1.0133 1.0139 1.0138 1.0134 1.0031 1.0116 1.0218 1.0121 1.0400 1.0162 1.0128 1.0103 0.9868 0.9871 1.0131 1.0132 1.0033 1.0033 1.0060
dispcorr: -0.030535557 hartree
energy: -1864.684027295708
dipole: 17.88426 -18.09682 -0.21257 -8.01416 7.84800 -0.16617 -11.28206 11.20139 -0.08067
magnitude: 0.28161 au
magnitude: 0.71579 debye
