program: Orca
programVersion: 5.0.2
elementType: F F F F F F O O O N N C C C C C C C C C C C C C C C C C C C C C C C C H H H H H H H H H H H H H H H H H H H H H H H H H H
charge: 0
multiplicity: 1
keywords: wb97x-d3
keywords: def2-TZVPP
keywords: def2/J RIJCOSX
keywords: DEFGRID2
keywords: scfconv7
keywords: smallprint printgap noloewdin
keywords: NOSOSCF
formula: C24H26F6N2O3
InChI: InChI=1/C24H26F6N2O3/c1-2-10-33-21-11-15(23(25,26)27)6-8-20(21)34-19-12-17-4-3-5-18(13-19)32(17)35-22-9-7-16(14-31-22)24(28,29)30/h6-9,11,14,17-19H,2-5,10,12-13H2,1H3
61 atoms
F  7.453044 -1.446737 0.467644
F  6.29165 -2.038864 2.173777
F  6.452698 -3.354109 0.479761
F  -8.324374 -1.365596 1.264823
F  -8.548982 -0.677234 -0.756033
F  -7.951722 -2.710872 -0.379514
O  1.697355 0.367547 -1.263595
O  -2.451711 0.012176 -0.241821
O  3.806867 1.933692 -0.235393
N  -2.008905 1.097034 0.538765
N  -4.145564 -1.29965 -0.805218
C  -0.963113 0.617339 1.43916
C  -1.486637 2.127574 -0.3556
C  0.253444 0.055741 0.68744
C  -0.285876 1.647387 -1.182158
C  0.820938 1.029365 -0.340625
C  -0.671306 1.770098 2.40537
C  -1.23417 3.35838 0.519993
C  -0.321105 3.087639 1.714469
C  2.818782 -0.195864 -0.75566
C  -3.761515 -0.262767 -0.092044
C  3.880183 0.578841 -0.266847
C  2.938844 -1.578312 -0.760047
C  -4.626191 0.466586 0.72826
C  5.009931 -0.047201 0.234922
C  4.077059 -2.199498 -0.273214
C  5.112555 -1.433008 0.238842
C  -5.943255 0.065309 0.775479
C  -5.412267 -1.673867 -0.748553
C  -6.364141 -1.029151 0.026629
C  3.945219 2.604812 -1.485599
C  6.328098 -2.072439 0.835123
C  -7.795744 -1.451349 0.037646
C  5.356721 2.555155 -2.041427
C  5.468163 3.380094 -3.316807
H  -1.393028 -0.195451 2.030059
H  -2.288132 2.386956 -1.052178
H  -0.04809 -0.861183 0.173864
H  1.018784 -0.229182 1.413928
H  0.106827 2.482336 -1.768039
H  -0.631165 0.898216 -1.89879
H  1.387616 1.810911 0.165749
H  0.126889 1.473253 3.088917
H  -1.566406 1.914357 3.015668
H  -2.20556 3.70343 0.883256
H  -0.829538 4.163171 -0.097492
H  0.725059 3.093057 1.407353
H  -0.412472 3.905781 2.431698
H  2.121965 -2.167507 -1.155663
H  -4.274543 1.308212 1.302871
H  5.808688 0.574965 0.618938
H  4.138098 -3.278291 -0.290146
H  -6.63785 0.608069 1.403327
H  -5.672565 -2.534914 -1.35282
H  3.662936 3.640108 -1.283541
H  3.235289 2.210525 -2.220158
H  6.05625 2.93029 -1.290234
H  5.641469 1.520423 -2.248267
H  6.479454 3.345438 -3.719503
H  4.794995 3.01131 -4.092284
H  5.222804 4.428367 -3.138498
totalener: -1864.65009962 hartree
nucrepener: 3808.75654552 hartree
electener: -5673.40664514 hartree
twoeener: 4462.30626029 hartree
kineticenergy: 1857.37949576 hartree
xcener: -168.782571306057 hartree
chargesum: -0.0000000
charge: -0.176653 -0.171691 -0.174794 -0.175437 -0.169711 -0.173023 -0.344288 -0.244297 -0.351320 -0.051497 -0.297484 0.143279 0.096723 -0.259194 -0.186895 0.123135 -0.221609 -0.207120 -0.130556 0.154802 0.322070 0.198001 -0.155407 -0.180295 -0.211927 -0.130099 -0.018631 -0.131605 -0.010310 -0.068089 0.030345 0.547238 0.542446 -0.099855 -0.256052 0.080762 0.081147 0.105093 0.096107 0.079117 0.104784 0.081324 0.078741 0.091200 0.088465 0.074980 0.080184 0.083199 0.128746 0.130737 0.120749 0.133641 0.130520 0.119616 0.090088 0.079372 0.064702 0.071447 0.090959 0.079174 0.074948
qa: -0.1767 -0.1717 -0.1748 -0.1754 -0.1697 -0.1730 -0.3443 -0.2443 -0.3513 -0.0515 -0.2975 0.1433 0.0967 -0.2592 -0.1869 0.1231 -0.2216 -0.2071 -0.1306 0.1548 0.3221 0.1980 -0.1554 -0.1803 -0.2119 -0.1301 -0.0186 -0.1316 -0.0103 -0.0681 0.0303 0.5472 0.5424 -0.0999 -0.2561 0.0808 0.0811 0.1051 0.0961 0.0791 0.1048 0.0813 0.0787 0.0912 0.0885 0.0750 0.0802 0.0832 0.1287 0.1307 0.1207 0.1336 0.1305 0.1196 0.0901 0.0794 0.0647 0.0714 0.0910 0.0792 0.0749
va: 1.1258 1.1221 1.1296 1.1237 1.1207 1.1317 2.0265 2.1236 1.9956 2.8032 3.0811 3.9936 3.9785 3.9727 3.9351 3.8729 3.9625 3.9543 3.9141 3.9262 4.1069 3.8703 4.0048 3.9497 4.1626 3.9949 3.7158 4.0467 4.1216 3.6710 3.8710 4.4375 4.4380 3.8840 3.9597 1.0034 1.0057 1.0278 1.0120 1.0173 1.0346 0.9974 1.0154 1.0115 1.0122 1.0160 1.0082 1.0118 1.0137 1.0346 1.0298 1.0137 1.0169 1.0135 0.9956 0.9984 1.0123 1.0051 1.0054 1.0034 1.0034
dispcorr: -0.033367837 hartree
energy: -1864.683467454758
dipole: 27.89854 -27.68420 0.21434 48.76059 -46.90507 1.85552 -10.18828 10.32392 0.13564
magnitude: 1.87278 au
magnitude: 4.76023 debye
