program: Orca
programVersion: 5.0.2
elementType: F F F O O O O O N C C C C C C C C C C C C C C C C C C C C C C H H H H H H H H H H H H H H H H H H H H
charge: 0
multiplicity: 1
keywords: wb97x-d3
keywords: def2-TZVPP
keywords: def2/J RIJCOSX
keywords: DEFGRID2
keywords: scfconv7
keywords: smallprint printgap noloewdin
keywords: NOSOSCF
formula: C22H20F3NO5
InChI: InChI=1/C22H20F3NO5/c1-5-17-13(3)20(30-21(27)28-4)16-11-19(12(2)10-18(16)26-17)29-14-6-8-15(9-7-14)31-22(23,24)25/h6-11H,5H2,1-4H3
51 atoms
F  6.702299 -0.03743 -0.361807
F  7.352539 -0.87175 -2.239361
F  5.665797 0.467386 -2.168252
O  -2.290188 2.652251 0.518735
O  0.812846 -1.242862 1.455195
O  -3.158545 2.208788 2.493508
O  5.520394 -1.619187 -1.394749
O  -1.849918 4.012596 2.193989
N  -4.066187 -0.747858 -1.034895
C  -2.232047 0.288908 0.152768
C  -2.86838 -0.833971 -0.414932
C  -4.137366 1.614076 -0.566015
C  -4.674584 0.40673 -1.11161
C  -2.921928 1.515203 0.048971
C  -0.972289 0.13517 0.76676
C  -1.018483 -2.254794 0.273364
C  -2.237095 -2.092871 -0.332776
C  -0.399235 -1.102483 0.817043
C  -6.021337 0.411852 -1.775133
C  -4.8819 2.906763 -0.692329
C  -0.364063 -3.596528 0.374314
C  -7.141592 0.152278 -0.768903
C  1.946745 -1.31159 0.697301
C  1.972253 -1.046033 -0.665988
C  3.1127 -1.666263 1.36727
C  -2.405375 3.024585 1.799515
C  3.171594 -1.134561 -1.357688
C  4.309019 -1.745782 0.676419
C  4.326575 -1.478456 -0.682466
C  -3.331559 2.505033 3.885989
C  6.287786 -0.527564 -1.532095
H  -0.444061 0.979035 1.192251
H  -2.744895 -2.947853 -0.761758
H  -6.198226 1.357944 -2.287787
H  -6.032889 -0.369144 -2.535859
H  -4.413972 3.720302 -0.143914
H  -4.949095 3.214907 -1.737069
H  -5.902375 2.810198 -0.321322
H  0.568408 -3.637489 -0.192442
H  -0.124344 -3.850574 1.407741
H  -1.020341 -4.371749 -0.017853
H  -8.110953 0.151376 -1.267257
H  -7.014204 -0.816172 -0.2850
H  -7.170728 0.913588 0.011596
H  1.076498 -0.769319 -1.205524
H  3.083653 -1.879852 2.42783
H  3.189212 -0.94555 -2.422724
H  5.213392 -2.034547 1.195612
H  -3.839288 3.459012 4.020748
H  -2.374213 2.514258 4.404891
H  -3.950089 1.705042 4.280246
elementType: F O N C H
totalener: -1581.00966751 hartree
nucrepener: 3038.84468585 hartree
electener: -4619.85435336 hartree
oneelecener: -8206.62782630 hartree
twoeener: 3586.77347294 hartree
cpcmener: -0.03552274 hartree
kineticenergy: 1574.74034000 hartree
xcener: -144.851097991044 hartree
chargesum: -0.0000000
charge: -0.175467 -0.167034 -0.174985 -0.313993 -0.332454 -0.262931 -0.314699 -0.464972 -0.349154 -0.041110 0.153692 -0.022780 0.193209 0.233331 -0.085743 -0.003492 -0.234364 0.117012 -0.143109 -0.252955 -0.217537 -0.271224 0.261110 -0.158894 -0.220081 0.552922 -0.176745 -0.138909 0.192498 -0.123071 0.589699 0.147996 0.115461 0.087032 0.079501 0.098607 0.115925 0.114598 0.103742 0.113270 0.101797 0.096578 0.087306 0.089098 0.152691 0.148768 0.158313 0.157284 0.127645 0.125764 0.130856
qa: -0.1755 -0.1670 -0.1750 -0.3140 -0.3325 -0.2629 -0.3147 -0.4650 -0.3492 -0.0411 0.1537 -0.0228 0.1932 0.2333 -0.0857 -0.0035 -0.2344 0.1170 -0.1431 -0.2530 -0.2175 -0.2712 0.2611 -0.1589 -0.2201 0.5529 -0.1767 -0.1389 0.1925 -0.1231 0.5897 0.1480 0.1155 0.0870 0.0795 0.0986 0.1159 0.1146 0.1037 0.1133 0.1018 0.0966 0.0873 0.0891 0.1527 0.1488 0.1583 0.1573 0.1276 0.1258 0.1309
va: 1.1239 1.1379 1.1242 2.1315 2.0732 2.1021 2.0737 2.0458 3.1134 3.7497 3.9099 3.7826 3.8026 3.6821 3.9107 3.8569 4.1427 3.8773 3.8825 3.9173 3.8932 3.9152 3.6926 3.8501 4.0011 4.3107 4.0513 4.0235 3.7242 3.8333 4.6151 1.0191 1.0417 1.0034 1.0227 1.0153 0.9948 0.9911 0.9975 0.9978 1.0043 1.0039 1.0077 1.0013 1.0019 1.0072 0.9992 0.9969 0.9916 0.9924 0.9940
dispcorr: -0.025321539 hartree
energy: -1581.034989051698
dipole: -66.47732 64.15117 -2.32615 -0.49229 -0.21602 -0.70831 10.02677 -9.22771 0.79905
magnitude: 2.55952 au
magnitude: 6.50579 debye
