program: Orca
programVersion: 5.0.2
elementType: F F F O O O O O N C C C C C C C C C C C C C C C C C C C C C C H H H H H H H H H H H H H H H H H H H H
charge: 0
multiplicity: 1
keywords: wb97x-d3
keywords: def2-TZVPP
keywords: def2/J RIJCOSX
keywords: DEFGRID2
keywords: scfconv7
keywords: smallprint printgap noloewdin
keywords: NOSOSCF
formula: C22H20F3NO5
InChI: InChI=1/C22H20F3NO5/c1-5-17-13(3)20(30-21(27)28-4)16-11-19(12(2)10-18(16)26-17)29-14-6-8-15(9-7-14)31-22(23,24)25/h6-11H,5H2,1-4H3
51 atoms
F  6.111863 0.231381 0.456337
F  7.003884 0.142616 -1.50238
F  5.160999 1.214863 -1.190187
O  -2.576087 1.881131 1.835458
O  0.47393 -2.151749 1.404696
O  -1.32863 2.633967 0.184738
O  5.219645 -1.011886 -1.164383
O  -1.112517 3.468437 2.263826
N  -4.375348 -0.767277 -0.788162
C  -2.52288 -0.204021 0.660697
C  -3.188148 -1.079498 -0.221797
C  -4.357277 1.358087 0.347726
C  -4.933919 0.385624 -0.528447
C  -3.161904 1.027242 0.918371
C  -1.28057 -0.583258 1.207705
C  -1.382175 -2.694289 -0.011551
C  -2.596669 -2.323269 -0.528173
C  -0.738364 -1.787004 0.863045
C  -6.219453 0.684934 -1.243215
C  -5.054967 2.654675 0.617591
C  -0.74917 -4.008148 -0.34414
C  -5.968857 1.392115 -2.574455
C  1.6119 -1.835918 0.719979
C  1.619077 -1.106893 -0.462783
C  2.804163 -2.29232 1.272195
C  -1.61341 2.731586 1.460145
C  2.827307 -0.82099 -1.08318
C  4.006626 -2.002142 0.653701
C  4.007048 -1.264383 -0.518454
C  -0.270064 3.461957 -0.314435
C  5.854207 0.127085 -0.848365
H  -0.744408 0.057856 1.895861
H  -3.124282 -2.989036 -1.20002
H  -6.738258 -0.255778 -1.428404
H  -6.87685 1.293413 -0.621311
H  -6.004803 2.483653 1.126862
H  -4.470154 3.327186 1.239758
H  -5.27997 3.182089 -0.309649
H  0.194102 -3.878236 -0.878283
H  -0.534016 -4.589574 0.553099
H  -1.407168 -4.600288 -0.977235
H  -6.911924 1.595127 -3.081922
H  -5.453854 2.343876 -2.4397
H  -5.360368 0.775336 -3.236101
H  0.703941 -0.749001 -0.914467
H  2.790608 -2.87015 2.187046
H  2.83201 -0.264487 -2.01097
H  4.933267 -2.363967 1.079005
H  -0.199894 3.23947 -1.374503
H  0.673672 3.219177 0.171466
H  -0.501019 4.516573 -0.17845
elementType: F O N C H
totalener: -1581.00945823 hartree
nucrepener: 3094.68755013 hartree
electener: -4675.69700836 hartree
oneelecener: -8317.85346323 hartree
twoeener: 3642.15645487 hartree
cpcmener: -0.03575543 hartree
kineticenergy: 1574.75775652 hartree
xcener: -144.854390089900 hartree
chargesum: -0.0000000
charge: -0.175182 -0.166488 -0.175607 -0.313628 -0.334181 -0.263132 -0.315508 -0.463790 -0.350588 -0.022675 0.159693 -0.026674 0.193369 0.230290 -0.095783 -0.004428 -0.234489 0.119652 -0.142167 -0.251971 -0.223357 -0.270496 0.276564 -0.159083 -0.227261 0.551118 -0.182279 -0.135853 0.191417 -0.125268 0.590310 0.147796 0.116064 0.079257 0.085808 0.115060 0.099178 0.113917 0.104399 0.111662 0.100587 0.096669 0.089150 0.087448 0.150239 0.148593 0.157953 0.156437 0.130498 0.127144 0.129614
qa: -0.1752 -0.1665 -0.1756 -0.3136 -0.3342 -0.2631 -0.3155 -0.4638 -0.3506 -0.0227 0.1597 -0.0267 0.1934 0.2303 -0.0958 -0.0044 -0.2345 0.1197 -0.1422 -0.2520 -0.2234 -0.2705 0.2766 -0.1591 -0.2273 0.5511 -0.1823 -0.1359 0.1914 -0.1253 0.5903 0.1478 0.1161 0.0793 0.0858 0.1151 0.0992 0.1139 0.1044 0.1117 0.1006 0.0967 0.0892 0.0874 0.1502 0.1486 0.1580 0.1564 0.1305 0.1271 0.1296
va: 1.1237 1.1388 1.1234 2.1312 2.0733 2.1006 2.0727 2.0468 3.1113 3.7264 3.8972 3.7924 3.8021 3.7025 3.8983 3.8580 4.1398 3.8692 3.8825 3.9147 3.9030 3.9150 3.6805 3.8570 4.0100 4.3113 4.0568 4.0172 3.7224 3.8302 4.6147 1.0181 1.0412 1.0231 1.0039 0.9954 1.0154 0.9914 0.9970 0.9974 1.0040 1.0041 1.0015 1.0073 1.0038 1.0073 0.9997 0.9969 0.9940 0.9916 0.9931
dispcorr: -0.025865225 hartree
energy: -1581.035323450253
dipole: -55.82697 54.76330 -1.06367 1.78642 -1.72414 0.06228 -7.94842 6.48672 -1.46170
magnitude: 1.80882 au
magnitude: 4.59765 debye
