program: Orca
programVersion: 5.0.2
elementType: F F F O O O O O N C C C C C C C C C C C C C C C C C C C C C C H H H H H H H H H H H H H H H H H H H H
charge: 0
multiplicity: 1
keywords: wb97x-d3
keywords: def2-TZVPP
keywords: def2/J RIJCOSX
keywords: DEFGRID2
keywords: scfconv7
keywords: smallprint printgap noloewdin
keywords: NOSOSCF
formula: C22H20F3NO5
InChI: InChI=1/C22H20F3NO5/c1-5-17-13(3)20(30-21(27)28-4)16-11-19(12(2)10-18(16)26-17)29-14-6-8-15(9-7-14)31-22(23,24)25/h6-11H,5H2,1-4H3
51 atoms
F  6.406003 -2.736872 -0.403644
F  7.175564 -2.76195 1.607299
F  5.181174 -3.464669 1.192576
O  -2.92447 2.857844 0.324322
O  1.049681 0.289658 -1.418445
O  -2.509822 4.736826 -0.609159
O  5.674693 -1.293032 1.128912
O  -3.327433 3.07138 -1.884558
N  -3.999374 -1.137778 0.238875
C  -2.342838 0.583429 -0.134882
C  -2.763396 -0.761268 -0.159936
C  -4.553974 1.163914 0.687519
C  -4.848915 -0.236009 0.656014
C  -3.301817 1.529269 0.286142
C  -1.029585 0.906709 -0.528123
C  -0.600784 -1.437772 -1.052365
C  -1.87021 -1.745199 -0.632643
C  -0.196631 -0.080886 -0.970738
C  -6.177957 -0.734998 1.144203
C  -5.589667 2.158555 1.111177
C  0.314668 -2.496037 -1.585668
C  -6.156122 -0.997377 2.649575
C  2.159851 -0.102274 -0.728339
C  3.371458 0.030201 -1.39652
C  2.120752 -0.589596 0.571292
C  -2.956162 3.52711 -0.837551
C  4.545977 -0.361439 -0.779662
C  3.298078 -0.997539 1.182152
C  4.493831 -0.891922 0.498264
C  -2.406231 5.607808 -1.742745
C  6.092567 -2.543832 0.878914
H  -0.661795 1.924047 -0.485219
H  -2.216139 -2.770778 -0.67428
H  -6.970467 -0.024369 0.906394
H  -6.414643 -1.661354 0.620221
H  -5.194354 3.168937 1.176593
H  -6.420714 2.176698 0.404001
H  -6.00561 1.90723 2.086955
H  -0.248996 -3.392754 -1.837265
H  0.840943 -2.168303 -2.482167
H  1.071124 -2.781347 -0.852311
H  -5.410487 -1.750694 2.904499
H  -5.9249 -0.094628 3.216362
H  -7.126276 -1.361307 2.987864
H  3.394667 0.433067 -2.400568
H  1.189048 -0.6686 1.116107
H  5.489551 -0.249031 -1.29654
H  3.272846 -1.386293 2.191627
H  -3.377585 5.769087 -2.207606
H  -1.704891 5.210964 -2.475296
H  -2.02961 6.549291 -1.35589
elementType: F O N C H
totalener: -1581.01095774 hartree
nucrepener: 3024.29870095 hartree
electener: -4605.30965869 hartree
oneelecener: -8178.21296350 hartree
twoeener: 3572.90330481 hartree
cpcmener: -0.03426001 hartree
kineticenergy: 1574.75474102 hartree
xcener: -144.853821923333 hartree
chargesum: -0.0000000
charge: -0.175576 -0.166480 -0.174090 -0.319987 -0.332448 -0.288747 -0.315850 -0.464586 -0.346632 -0.041564 0.142049 -0.025278 0.195300 0.218344 -0.090569 -0.009818 -0.222482 0.130675 -0.141221 -0.256702 -0.221891 -0.270135 0.298696 -0.240349 -0.202977 0.584375 -0.120744 -0.154299 0.178963 -0.122751 0.590976 0.145925 0.114975 0.086622 0.078722 0.102220 0.115878 0.115712 0.105731 0.115423 0.107597 0.088105 0.089121 0.096213 0.149028 0.155048 0.157051 0.158865 0.124689 0.126115 0.132755
qa: -0.1756 -0.1665 -0.1741 -0.3200 -0.3324 -0.2887 -0.3158 -0.4646 -0.3466 -0.0416 0.1420 -0.0253 0.1953 0.2183 -0.0906 -0.0098 -0.2225 0.1307 -0.1412 -0.2567 -0.2219 -0.2701 0.2987 -0.2403 -0.2030 0.5844 -0.1207 -0.1543 0.1790 -0.1228 0.5910 0.1459 0.1150 0.0866 0.0787 0.1022 0.1159 0.1157 0.1057 0.1154 0.1076 0.0881 0.0891 0.0962 0.1490 0.1550 0.1571 0.1589 0.1247 0.1261 0.1328
va: 1.1236 1.1390 1.1246 2.1253 2.0695 2.1244 2.0738 2.0284 3.1134 3.7775 3.9293 3.7943 3.8054 3.6699 3.9211 3.8617 4.1318 3.8541 3.8829 3.9103 3.8808 3.9128 3.6578 4.0034 3.8669 4.2644 3.9949 4.0229 3.7400 3.8445 4.6127 1.0217 1.0415 1.0031 1.0240 1.0145 0.9920 0.9944 1.0044 0.9988 0.9941 1.0068 1.0019 1.0040 1.0080 1.0005 0.9976 0.9972 0.9915 0.9903 0.9949
dispcorr: -0.025008841 hartree
energy: -1581.035966576511
dipole: -59.21311 58.20793 -1.00518 16.88587 -15.26474 1.62114 -0.82446 1.08841 0.26395
magnitude: 1.92565 au
magnitude: 4.89462 debye
