program: Orca
programVersion: 5.0.2
elementType: F F F O O O O O N C C C C C C C C C C C C C C C C C C C C C C H H H H H H H H H H H H H H H H H H H H
charge: 0
multiplicity: 1
keywords: wb97x-d3
keywords: def2-TZVPP
keywords: def2/J RIJCOSX
keywords: DEFGRID2
keywords: scfconv7
keywords: smallprint printgap noloewdin
keywords: NOSOSCF
formula: C22H20F3NO5
InChI: InChI=1/C22H20F3NO5/c1-5-17-13(3)20(30-21(27)28-4)16-11-19(12(2)10-18(16)26-17)29-14-6-8-15(9-7-14)31-22(23,24)25/h6-11H,5H2,1-4H3
51 atoms
F  6.352238 -2.472347 -1.237318
F  5.217931 -1.96787 -2.981314
F  7.200963 -1.167595 -2.727408
O  -2.562342 2.746494 0.742998
O  1.080363 -0.655022 1.611278
O  -3.539414 2.296591 2.665023
O  5.640158 -0.375831 -1.478737
O  -2.394732 4.210762 2.380848
N  -3.924766 -0.899472 -0.664399
C  -2.196928 0.41056 0.407502
C  -2.703714 -0.807242 -0.091249
C  -4.271511 1.456512 -0.301699
C  -4.670254 0.169125 -0.777375
C  -3.044028 1.531701 0.291683
C  -0.906024 0.448413 0.972625
C  -0.658435 -1.945916 0.570383
C  -1.913356 -1.971101 0.018351
C  -0.171604 -0.700184 1.037624
C  -5.98569 0.001977 -1.480912
C  -5.179196 2.641509 -0.416231
C  0.171397 -3.185246 0.689746
C  -5.855525 0.271033 -2.97946
C  2.170045 -0.593661 0.790273
C  3.408331 -0.770492 1.398127
C  2.085149 -0.351254 -0.574705
C  -2.816732 3.157232 1.992473
C  4.563702 -0.717161 0.638851
C  3.245349 -0.29864 -1.333735
C  4.469966 -0.485934 -0.723226
C  -3.848298 2.623192 4.026167
C  6.085036 -1.482933 -2.090437
H  -0.484552 1.372934 1.346088
H  -2.321867 -2.903601 -0.351086
H  -6.332349 -1.020101 -1.328073
H  -6.740492 0.661324 -1.050905
H  -5.984634 2.585292 0.318479
H  -4.656903 3.582078 -0.258205
H  -5.643885 2.694991 -1.399224
H  -0.398265 -4.057656 0.375638
H  1.066705 -3.135414 0.066934
H  0.502335 -3.351333 1.715561
H  -5.496816 1.280507 -3.181981
H  -5.158592 -0.427511 -3.441934
H  -6.8197 0.1567 -3.474174
H  3.467272 -0.950734 2.463505
H  1.13302 -0.195527 -1.063562
H  5.528105 -0.844901 1.112463
H  3.180552 -0.092521 -2.393646
H  -4.448537 1.797991 4.395208
H  -4.42164 3.546217 4.086489
H  -2.940473 2.707333 4.620604
elementType: F O N C H
totalener: -1581.00973346 hartree
nucrepener: 3035.68023881 hartree
electener: -4616.68997227 hartree
oneelecener: -8200.27270447 hartree
twoeener: 3583.58273220 hartree
cpcmener: -0.03503124 hartree
kineticenergy: 1574.75707061 hartree
xcener: -144.854364658368 hartree
chargesum: -0.0000000
charge: -0.175070 -0.175612 -0.167011 -0.316926 -0.333720 -0.263278 -0.315513 -0.463490 -0.348743 -0.036809 0.148494 0.003507 0.206356 0.199918 -0.086463 -0.002528 -0.231331 0.111568 -0.145609 -0.270002 -0.217354 -0.270308 0.258903 -0.217117 -0.157244 0.556896 -0.139325 -0.176171 0.192249 -0.123948 0.590795 0.147541 0.115474 0.079387 0.088581 0.118205 0.106613 0.116510 0.102256 0.102903 0.113272 0.089359 0.088251 0.096470 0.148709 0.152220 0.156819 0.157790 0.130409 0.126143 0.127971
qa: -0.1751 -0.1756 -0.1670 -0.3169 -0.3337 -0.2633 -0.3155 -0.4635 -0.3487 -0.0368 0.1485 0.0035 0.2064 0.1999 -0.0865 -0.0025 -0.2313 0.1116 -0.1456 -0.2700 -0.2174 -0.2703 0.2589 -0.2171 -0.1572 0.5569 -0.1393 -0.1762 0.1922 -0.1239 0.5908 0.1475 0.1155 0.0794 0.0886 0.1182 0.1066 0.1165 0.1023 0.1029 0.1133 0.0894 0.0883 0.0965 0.1487 0.1522 0.1568 0.1578 0.1304 0.1261 0.1280
va: 1.1241 1.1233 1.1379 2.1281 2.0707 2.1015 2.0741 2.0472 3.1123 3.7451 3.9113 3.7529 3.7892 3.7197 3.9123 3.8573 4.1431 3.8693 3.8864 3.9154 3.8937 3.9122 3.6933 3.9976 3.8559 4.3023 4.0213 4.0536 3.7211 3.8343 4.6140 1.0197 1.0413 1.0238 1.0007 0.9913 1.0106 0.9955 1.0043 0.9979 0.9980 1.0017 1.0070 1.0041 1.0071 1.0026 0.9968 0.9997 0.9944 0.9921 0.9916
dispcorr: -0.025339361 hartree
energy: -1581.035072819909
dipole: -61.85408 59.63912 -2.21495 8.18818 -8.60741 -0.41923 9.62626 -8.75663 0.86963
magnitude: 2.41620 au
magnitude: 6.14149 debye
