program: Orca
programVersion: 5.0.2
elementType: F F F O O O O O N C C C C C C C C C C C C C C C C C C C C C C H H H H H H H H H H H H H H H H H H H H
charge: 0
multiplicity: 1
keywords: wb97x-d3
keywords: def2-TZVPP
keywords: def2/J RIJCOSX
keywords: DEFGRID2
keywords: scfconv7
keywords: smallprint printgap noloewdin
keywords: NOSOSCF
formula: C22H20F3NO5
InChI: InChI=1/C22H20F3NO5/c1-5-17-13(3)20(30-21(27)28-4)16-11-19(12(2)10-18(16)26-17)29-14-6-8-15(9-7-14)31-22(23,24)25/h6-11H,5H2,1-4H3
51 atoms
F  6.493017 -2.464898 -0.85136
F  5.326117 -1.622482 -2.433134
F  7.247502 -0.775897 -1.951825
O  -2.914769 2.025942 1.758054
O  0.633398 -1.536821 1.469338
O  -2.121169 3.831943 2.572792
O  5.631251 -0.428784 -0.576009
O  -2.167118 3.605935 0.33267
N  -4.010721 -0.530609 -1.301842
C  -2.448678 0.111058 0.427336
C  -2.869554 -0.744508 -0.61093
C  -4.459815 1.41827 0.040975
C  -4.771558 0.489447 -0.99925
C  -3.291234 1.203604 0.715386
C  -1.244524 -0.159852 1.10788
C  -0.902953 -2.137558 -0.281234
C  -2.072369 -1.860848 -0.94119
C  -0.50931 -1.254129 0.754834
C  -6.043038 0.633019 -1.784221
C  -5.363395 2.573032 0.346098
C  -0.073139 -3.333863 -0.627261
C  -7.199507 -0.116256 -1.124557
C  1.844412 -1.227879 0.919991
C  1.987647 -0.43941 -0.214434
C  2.962176 -1.73746 1.571073
C  -2.370642 3.210436 1.447808
C  3.256466 -0.187922 -0.713522
C  4.228014 -1.477501 1.075663
C  4.360307 -0.714512 -0.071826
C  -1.551816 5.143117 2.477961
C  6.15476 -1.314625 -1.437001
H  -0.899411 0.480941 1.909025
H  -2.410142 -2.513008 -1.737041
H  -6.305373 1.684444 -1.907068
H  -5.877514 0.229966 -2.783644
H  -5.241191 3.371863 -0.387597
H  -6.409913 2.274157 0.323671
H  -5.178188 2.997618 1.330416
H  0.128946 -3.952033 0.247646
H  -0.584016 -3.951106 -1.363184
H  0.891978 -3.049872 -1.050458
H  -8.113266 0.00177 -1.70665
H  -6.983818 -1.182423 -1.054435
H  -7.398976 0.249407 -0.11666
H  1.13053 -0.018401 -0.722643
H  2.842129 -2.33919 2.462329
H  3.373693 0.42633 -1.596287
H  5.098179 -1.865378 1.588322
H  -1.446012 5.490795 3.500552
H  -2.209214 5.817297 1.932188
H  -0.573258 5.111844 2.002772
elementType: F O N C H
totalener: -1581.01166530 hartree
nucrepener: 3030.84583122 hartree
electener: -4611.85749653 hartree
oneelecener: -8191.25209578 hartree
twoeener: 3579.39459925 hartree
cpcmener: -0.03305908 hartree
kineticenergy: 1574.77814171 hartree
xcener: -144.857904967180 hartree
chargesum: -0.0000000
charge: -0.176452 -0.173483 -0.167116 -0.320370 -0.333782 -0.288358 -0.316595 -0.465432 -0.349422 -0.029755 0.139531 0.002951 0.210853 0.195721 -0.099249 -0.006624 -0.226748 0.124324 -0.146767 -0.269258 -0.217993 -0.269462 0.265922 -0.163048 -0.227425 0.588175 -0.172814 -0.131943 0.188399 -0.123234 0.591070 0.145472 0.116070 0.088507 0.079533 0.120268 0.116982 0.108326 0.113500 0.102646 0.103529 0.096205 0.087191 0.089176 0.153098 0.148845 0.158780 0.156453 0.132816 0.124995 0.125996
qa: -0.1765 -0.1735 -0.1671 -0.3204 -0.3338 -0.2884 -0.3166 -0.4654 -0.3494 -0.0298 0.1395 0.0030 0.2109 0.1957 -0.0992 -0.0066 -0.2267 0.1243 -0.1468 -0.2693 -0.2180 -0.2695 0.2659 -0.1630 -0.2274 0.5882 -0.1728 -0.1319 0.1884 -0.1232 0.5911 0.1455 0.1161 0.0885 0.0795 0.1203 0.1170 0.1083 0.1135 0.1026 0.1035 0.0962 0.0872 0.0892 0.1531 0.1488 0.1588 0.1565 0.1328 0.1250 0.1260
va: 1.1231 1.1249 1.1379 2.1253 2.0684 2.1242 2.0730 2.0318 3.1116 3.7484 3.9305 3.7583 3.7746 3.7160 3.9130 3.8605 4.1331 3.8527 3.8883 3.9062 3.8895 3.9125 3.6886 3.8492 4.0053 4.2621 4.0419 4.0185 3.7252 3.8443 4.6136 1.0231 1.0410 1.0002 1.0229 0.9928 0.9960 1.0085 0.9983 1.0044 0.9978 1.0042 1.0077 1.0018 1.0018 1.0073 0.9975 0.9981 0.9947 0.9910 0.9908
dispcorr: -0.024968787 hartree
energy: -1581.036634090873
dipole: -61.00320 59.77405 -1.22915 13.07136 -11.90355 1.16781 5.85303 -4.72282 1.13022
magnitude: 2.03764 au
magnitude: 5.17927 debye
