program: Orca
programVersion: 5.0.2
elementType: F F F O O O O O N C C C C C C C C C C C C C C C C C C C C C C H H H H H H H H H H H H H H H H H H H H
charge: 0
multiplicity: 1
keywords: wb97x-d3
keywords: def2-TZVPP
keywords: def2/J RIJCOSX
keywords: DEFGRID2
keywords: scfconv7
keywords: smallprint printgap noloewdin
keywords: NOSOSCF
formula: C22H20F3NO5
InChI: InChI=1/C22H20F3NO5/c1-5-17-13(3)20(30-21(27)28-4)16-11-19(12(2)10-18(16)26-17)29-14-6-8-15(9-7-14)31-22(23,24)25/h6-11H,5H2,1-4H3
51 atoms
F  7.18446 -2.436957 1.833722
F  5.16494 -3.184464 1.763773
F  6.269961 -2.935437 -0.050616
O  -2.711417 2.846741 0.210409
O  1.037521 0.069914 -1.677162
O  -2.561443 4.802032 -0.634282
O  5.65709 -1.121248 1.086718
O  -3.871949 3.292744 -1.669884
N  -3.972625 -1.090449 0.280823
C  -2.277983 0.552647 -0.238818
C  -2.742239 -0.776816 -0.181832
C  -4.40694 1.239841 0.709777
C  -4.767497 -0.143265 0.706511
C  -3.167619 1.543813 0.222623
C  -0.984115 0.81839 -0.730941
C  -0.643728 -1.565991 -1.126918
C  -1.901204 -1.812908 -0.639271
C  -0.2036 -0.218006 -1.155014
C  -6.103384 -0.574946 1.239033
C  -5.3610 2.288447 1.192137
C  0.230697 -2.67393 -1.625868
C  -6.055199 -0.832184 2.744121
C  2.145756 -0.243526 -0.942367
C  3.35402 -0.266063 -1.628974
C  2.104031 -0.509485 0.420161
C  -3.121002 3.630099 -0.79601
C  4.523726 -0.569547 -0.955852
C  3.2771 -0.821813 1.091289
C  4.471962 -0.853721 0.39802
C  -2.860249 5.801891 -1.615714
C  6.052012 -2.400913 1.15072
H  -0.600141 1.82923 -0.777903
H  -2.276541 -2.828141 -0.604953
H  -6.866706 0.171381 1.015605
H  -6.396828 -1.491228 0.726785
H  -6.133964 2.484509 0.446871
H  -5.866075 1.97715 2.104741
H  -4.866352 3.232423 1.410125
H  0.658231 -2.445999 -2.602289
H  1.062304 -2.868241 -0.94641
H  -0.339479 -3.596476 -1.716772
H  -5.770384 0.061208 3.300912
H  -7.031364 -1.151926 3.108306
H  -5.336439 -1.615774 2.983524
H  3.378898 -0.049578 -2.688625
H  1.174635 -0.479065 0.973014
H  5.465883 -0.5771 -1.487338
H  3.249135 -1.022628 2.15392
H  -3.925799 6.023341 -1.640025
H  -2.521719 5.494146 -2.603813
H  -2.31395 6.687367 -1.30689
elementType: F O N C H
totalener: -1581.01175865 hartree
nucrepener: 3017.71502774 hartree
electener: -4598.72678639 hartree
oneelecener: -8164.96038589 hartree
twoeener: 3566.23359950 hartree
cpcmener: -0.03347312 hartree
kineticenergy: 1574.77806074 hartree
xcener: -144.858022270985 hartree
chargesum: -0.0000000
charge: -0.166925 -0.174746 -0.174819 -0.321251 -0.335291 -0.288576 -0.315635 -0.466605 -0.349233 -0.040989 0.139555 -0.003394 0.209873 0.204862 -0.095573 -0.001870 -0.229587 0.121455 -0.145822 -0.266904 -0.215964 -0.269792 0.258389 -0.218234 -0.167613 0.589324 -0.133765 -0.167070 0.188943 -0.122900 0.590584 0.145705 0.115370 0.087962 0.079014 0.119949 0.117678 0.107246 0.114604 0.104007 0.103971 0.089435 0.095964 0.087684 0.149196 0.153128 0.156760 0.158516 0.125184 0.125226 0.132976
qa: -0.1669 -0.1747 -0.1748 -0.3213 -0.3353 -0.2886 -0.3156 -0.4666 -0.3492 -0.0410 0.1396 -0.0034 0.2099 0.2049 -0.0956 -0.0019 -0.2296 0.1215 -0.1458 -0.2669 -0.2160 -0.2698 0.2584 -0.2182 -0.1676 0.5893 -0.1338 -0.1671 0.1889 -0.1229 0.5906 0.1457 0.1154 0.0880 0.0790 0.1199 0.1177 0.1072 0.1146 0.1040 0.1040 0.0894 0.0960 0.0877 0.1492 0.1531 0.1568 0.1585 0.1252 0.1252 0.1330
va: 1.1382 1.1244 1.1244 2.1270 2.0669 2.1243 2.0737 2.0301 3.1134 3.7633 3.9326 3.7637 3.7774 3.6967 3.9167 3.8588 4.1417 3.8572 3.8875 3.9079 3.8837 3.9127 3.6953 3.9918 3.8551 4.2617 4.0100 4.0429 3.7269 3.8443 4.6151 1.0238 1.0416 1.0005 1.0237 0.9924 0.9961 1.0089 0.9994 0.9962 1.0047 1.0018 1.0043 1.0070 1.0071 1.0014 0.9973 0.9984 0.9909 0.9910 0.9948
dispcorr: -0.024972538 hartree
energy: -1581.036731187991
dipole: -59.46675 58.53358 -0.93317 16.93827 -15.30426 1.63400 -1.92417 2.10254 0.17838
magnitude: 1.89013 au
magnitude: 4.80433 debye
