program: Orca
programVersion: 5.0.2
elementType: F F F O O O O O N C C C C C C C C C C C C C C C C C C C C C C H H H H H H H H H H H H H H H H H H H H
charge: 0
multiplicity: 1
keywords: wb97x-d3
keywords: def2-TZVPP
keywords: def2/J RIJCOSX
keywords: DEFGRID2
keywords: scfconv7
keywords: smallprint printgap noloewdin
keywords: NOSOSCF
formula: C22H20F3NO5
InChI: InChI=1/C22H20F3NO5/c1-5-17-13(3)20(30-21(27)28-4)16-11-19(12(2)10-18(16)26-17)29-14-6-8-15(9-7-14)31-22(23,24)25/h6-11H,5H2,1-4H3
51 atoms
F  6.386874 -2.385108 -0.900132
F  5.186168 -1.705811 -2.536536
F  7.123543 -0.826674 -2.188272
O  -3.085274 1.975675 1.891345
O  0.675766 -1.386684 1.55372
O  -2.01219 3.646288 2.676309
O  5.536014 -0.326549 -0.822037
O  -1.820028 3.194942 0.477716
N  -4.134809 -0.753615 -1.036554
C  -2.535682 0.043043 0.593024
C  -2.946489 -0.866967 -0.401948
C  -4.629613 1.224879 0.246333
C  -4.940239 0.230558 -0.734172
C  -3.428654 1.096622 0.882462
C  -1.294114 -0.14361 1.232638
C  -0.883859 -2.128823 -0.126111
C  -2.096438 -1.94146 -0.738306
C  -0.505272 -1.197437 0.872514
C  -6.228336 0.306475 -1.501385
C  -5.597762 2.323399 0.557986
C  0.002384 -3.280306 -0.484709
C  -6.099296 1.18318 -2.746313
C  1.85042 -1.078691 0.929919
C  1.918576 -0.356926 -0.255044
C  3.011228 -1.519385 1.555287
C  -2.250364 2.9760 1.576954
C  3.154105 -0.118348 -0.837857
C  4.243693 -1.267204 0.979437
C  4.30001 -0.584571 -0.223865
C  -1.105399 4.7509 2.579804
C  6.039699 -1.30017 -1.596084
H  -0.956877 0.519726 2.01893
H  -2.428038 -2.635875 -1.500414
H  -6.508778 -0.703346 -1.80152
H  -7.032071 0.683799 -0.867829
H  -5.206678 3.03425 1.28114
H  -5.862807 2.883494 -0.338746
H  -6.524129 1.917887 0.967708
H  0.903158 -2.948776 -1.004672
H  0.32572 -3.834276 0.396904
H  -0.519214 -3.971716 -1.143616
H  -5.816436 2.206494 -2.497834
H  -5.346673 0.786293 -3.427739
H  -7.046996 1.22372 -3.283145
H  1.027168 0.016398 -0.741399
H  2.950358 -2.063665 2.488562
H  3.213261 0.436922 -1.764631
H  5.14679 -1.601383 1.472303
H  -1.477456 5.508028 1.891649
H  -0.117065 4.417344 2.267486
H  -1.045892 5.169165 3.57956
elementType: F O N C H
totalener: -1581.01143122 hartree
nucrepener: 3047.71322121 hartree
electener: -4628.72465243 hartree
oneelecener: -8225.06884904 hartree
twoeener: 3596.34419661 hartree
cpcmener: -0.03367108 hartree
kineticenergy: 1574.76596963 hartree
xcener: -144.855617319964 hartree
chargesum: -0.0000000
charge: -0.176331 -0.173966 -0.166444 -0.319239 -0.333938 -0.288891 -0.315808 -0.464407 -0.347597 -0.033332 0.147772 -0.024167 0.193462 0.217883 -0.078410 -0.004383 -0.229921 0.118733 -0.143681 -0.252416 -0.217726 -0.272049 0.277173 -0.177140 -0.231147 0.583148 -0.166985 -0.127256 0.183542 -0.122431 0.591236 0.144596 0.115308 0.078607 0.087138 0.100111 0.115334 0.115454 0.104807 0.114883 0.103377 0.089392 0.088166 0.096146 0.153397 0.149233 0.158812 0.156809 0.124999 0.125695 0.132449
qa: -0.1763 -0.1740 -0.1664 -0.3192 -0.3339 -0.2889 -0.3158 -0.4644 -0.3476 -0.0333 0.1478 -0.0242 0.1935 0.2179 -0.0784 -0.0044 -0.2299 0.1187 -0.1437 -0.2524 -0.2177 -0.2720 0.2772 -0.1771 -0.2311 0.5831 -0.1670 -0.1273 0.1835 -0.1224 0.5912 0.1446 0.1153 0.0786 0.0871 0.1001 0.1153 0.1155 0.1048 0.1149 0.1034 0.0894 0.0882 0.0961 0.1534 0.1492 0.1588 0.1568 0.1250 0.1257 0.1324
va: 1.1230 1.1243 1.1391 2.1264 2.0680 2.1231 2.0740 2.0281 3.1148 3.7636 3.9227 3.7942 3.8065 3.6671 3.8971 3.8599 4.1353 3.8697 3.8813 3.9104 3.8840 3.9165 3.6787 3.8532 4.0060 4.2657 4.0382 4.0071 3.7316 3.8450 4.6120 1.0205 1.0416 1.0236 1.0033 1.0149 0.9914 0.9950 0.9967 0.9986 1.0047 1.0016 1.0066 1.0040 1.0020 1.0074 0.9971 0.9983 0.9912 0.9904 0.9950
dispcorr: -0.025135886 hartree
energy: -1581.036567109200
dipole: -57.16758 56.01083 -1.15675 14.98201 -13.81351 1.16850 3.50508 -2.40184 1.10324
magnitude: 1.98005 au
magnitude: 5.03289 debye
