program: Orca
programVersion: 5.0.2
elementType: F F F O O O O O N C C C C C C C C C C C C C C C C C C C C C C H H H H H H H H H H H H H H H H H H H H
charge: 0
multiplicity: 1
keywords: wb97x-d3
keywords: def2-TZVPP
keywords: def2/J RIJCOSX
keywords: DEFGRID2
keywords: scfconv7
keywords: smallprint printgap noloewdin
keywords: NOSOSCF
formula: C22H20F3NO5
InChI: InChI=1/C22H20F3NO5/c1-5-17-13(3)20(30-21(27)28-4)16-11-19(12(2)10-18(16)26-17)29-14-6-8-15(9-7-14)31-22(23,24)25/h6-11H,5H2,1-4H3
51 atoms
F  7.057634 -0.762384 -2.179627
F  6.329231 -2.334253 -0.902348
F  5.123123 -1.644676 -2.529363
O  -3.031175 2.027681 1.821748
O  0.652518 -1.430044 1.610346
O  -1.883931 3.686194 2.525858
O  5.473672 -0.279785 -0.803193
O  -1.735544 3.136035 0.346401
N  -4.158265 -0.801239 -0.980714
C  -2.536946 0.02516 0.611361
C  -2.971116 -0.91616 -0.343985
C  -4.601174 1.242613 0.216525
C  -4.93834 0.214738 -0.719542
C  -3.402167 1.11251 0.855618
C  -1.298572 -0.162399 1.256357
C  -0.933349 -2.2068 -0.024863
C  -2.14529 -2.021326 -0.639206
C  -0.533967 -1.246007 0.936126
C  -6.223356 0.292743 -1.491829
C  -5.54056 2.378168 0.480528
C  -0.064445 -3.383003 -0.342458
C  -6.065842 1.10222 -2.778454
C  1.816672 -1.098389 0.978743
C  1.860582 -0.394929 -0.218542
C  2.991929 -1.496394 1.606228
C  -2.162915 2.981967 1.457527
C  3.086447 -0.130739 -0.810185
C  4.214301 -1.221254 1.019467
C  4.24685 -0.556564 -0.194661
C  -0.949012 4.759925 2.36668
C  5.977865 -1.244428 -1.587716
H  -0.943504 0.525338 2.013346
H  -2.493048 -2.737492 -1.373458
H  -6.535625 -0.721391 -1.741912
H  -7.014768 0.726614 -0.879554
H  -5.128478 3.11052 1.169891
H  -5.794892 2.903762 -0.4399
H  -6.475036 2.014895 0.910874
H  0.856798 -3.079256 -0.84302
H  0.223393 -3.928852 0.55637
H  -0.583408 -4.073686 -1.003832
H  -7.011139 1.146144 -3.319252
H  -5.750873 2.127019 -2.57958
H  -5.325386 0.648703 -3.437548
H  0.957906 -0.054307 -0.707714
H  2.949986 -2.026505 2.548706
H  3.125775 0.411787 -1.745478
H  5.128868 -1.524284 1.511488
H  0.023277 4.387407 2.0487
H  -0.857479 5.21652 3.347011
H  -1.315223 5.498556 1.655706
elementType: F O N C H
totalener: -1581.01144232 hartree
nucrepener: 3054.30246980 hartree
electener: -4635.31391212 hartree
oneelecener: -8238.24593669 hartree
twoeener: 3602.93202457 hartree
cpcmener: -0.03357356 hartree
kineticenergy: 1574.77304666 hartree
xcener: -144.856698573298 hartree
chargesum: -0.0000000
charge: -0.166325 -0.176181 -0.174099 -0.319543 -0.334348 -0.288803 -0.316145 -0.463577 -0.347986 -0.031393 0.149581 -0.023504 0.193805 0.217149 -0.075585 -0.003823 -0.231966 0.118065 -0.144263 -0.253862 -0.219499 -0.271862 0.271536 -0.167636 -0.227942 0.582589 -0.173586 -0.131604 0.187009 -0.122606 0.591355 0.144542 0.115813 0.078938 0.087162 0.100328 0.115706 0.115709 0.104736 0.114350 0.102763 0.096335 0.089391 0.088022 0.152741 0.149148 0.158814 0.157214 0.125524 0.132612 0.125202
qa: -0.1663 -0.1762 -0.1741 -0.3195 -0.3343 -0.2888 -0.3161 -0.4636 -0.3480 -0.0314 0.1496 -0.0235 0.1938 0.2171 -0.0756 -0.0038 -0.2320 0.1181 -0.1443 -0.2539 -0.2195 -0.2719 0.2715 -0.1676 -0.2279 0.5826 -0.1736 -0.1316 0.1870 -0.1226 0.5914 0.1445 0.1158 0.0789 0.0872 0.1003 0.1157 0.1157 0.1047 0.1144 0.1028 0.0963 0.0894 0.0880 0.1527 0.1491 0.1588 0.1572 0.1255 0.1326 0.1252
va: 1.1393 1.1232 1.1241 2.1261 2.0694 2.1234 2.0736 2.0287 3.1137 3.7593 3.9203 3.7948 3.8049 3.6699 3.8898 3.8580 4.1374 3.8719 3.8818 3.9101 3.8880 3.9165 3.6818 3.8492 4.0063 4.2658 4.0440 4.0120 3.7277 3.8448 4.6123 1.0202 1.0414 1.0233 1.0034 1.0149 0.9911 0.9948 0.9971 0.9983 1.0046 1.0039 1.0015 1.0068 1.0026 1.0072 0.9974 0.9979 0.9905 0.9950 0.9912
dispcorr: -0.025177918 hartree
energy: -1581.036620242425
dipole: -56.56513 55.43773 -1.12740 14.41394 -13.19873 1.21521 3.22015 -2.16226 1.05789
magnitude: 1.96644 au
magnitude: 4.99829 debye
