program: Orca
programVersion: 5.0.2
elementType: F F F O O O O O N C C C C C C C C C C C C C C C C C C C C C C H H H H H H H H H H H H H H H H H H H H
charge: 0
multiplicity: 1
keywords: wb97x-d3
keywords: def2-TZVPP
keywords: def2/J RIJCOSX
keywords: DEFGRID2
keywords: scfconv7
keywords: smallprint printgap noloewdin
keywords: NOSOSCF
formula: C22H20F3NO5
InChI: InChI=1/C22H20F3NO5/c1-5-17-13(3)20(30-21(27)28-4)16-11-19(12(2)10-18(16)26-17)29-14-6-8-15(9-7-14)31-22(23,24)25/h6-11H,5H2,1-4H3
51 atoms
F  5.276266 -1.855954 2.380872
F  6.238385 -2.583039 0.611908
F  7.221634 -1.106528 1.833684
O  -3.016477 2.336926 -1.433092
O  0.662999 -1.115735 -1.831795
O  -1.933402 4.15114 -1.759161
O  5.536373 -0.467238 0.66063
O  -1.772602 3.161236 0.25678
N  -4.177102 -0.962187 0.778808
C  -2.534955 0.142429 -0.611698
C  -2.981893 -0.959049 0.146696
C  -4.604437 1.270314 -0.02044
C  -4.952939 0.087518 0.704824
C  -3.398321 1.257017 -0.66015
C  -1.286505 0.07609 -1.26264
C  -0.938947 -2.172021 -0.378763
C  -2.159574 -2.101372 0.2421
C  -0.525215 -1.050178 -1.139106
C  -6.246682 0.023967 1.463806
C  -5.536353 2.440549 -0.075307
C  -0.078639 -3.392206 -0.275356
C  -6.103354 0.582822 2.878948
C  1.835554 -0.95305 -1.152839
C  1.905693 -0.464951 0.145459
C  2.994673 -1.285442 -1.84543
C  -2.188488 3.22663 -0.86752
C  3.143438 -0.324514 0.756678
C  4.227628 -1.138286 -1.236404
C  4.288953 -0.663081 0.062593
C  -1.014888 5.180971 -1.370802
C  6.048911 -1.492022 1.356485
H  -0.92456 0.893072 -1.873845
H  -2.518174 -2.942374 0.822641
H  -7.031433 0.565233 0.933718
H  -6.562108 -1.018137 1.51988
H  -6.47281 2.168146 -0.564484
H  -5.788523 2.791295 0.925628
H  -5.119316 3.28381 -0.619482
H  -0.625972 -4.205058 0.198284
H  0.256919 -3.737518 -1.253639
H  0.814443 -3.205186 0.324308
H  -7.052473 0.51816 3.411003
H  -5.363137 0.020719 3.448563
H  -5.79674 1.629179 2.875368
H  1.014423 -0.188382 0.692943
H  2.931463 -1.657618 -2.859544
H  3.20184 0.064872 1.764416
H  5.131051 -1.384184 -1.778545
H  -0.038646 4.761954 -1.130738
H  -1.394687 5.748789 -0.52275
H  -0.92552 5.834224 -2.232878
elementType: F O N C H
totalener: -1581.01182116 hartree
nucrepener: 3045.94655030 hartree
electener: -4626.95837146 hartree
oneelecener: -8221.53801884 hartree
twoeener: 3594.57964738 hartree
cpcmener: -0.03357840 hartree
kineticenergy: 1574.75373882 hartree
xcener: -144.852950094327 hartree
chargesum: -0.0000000
charge: -0.174928 -0.175308 -0.166826 -0.320398 -0.333410 -0.289230 -0.315294 -0.465303 -0.346923 -0.029600 0.151174 -0.019779 0.192218 0.212942 -0.083808 0.001321 -0.234076 0.114121 -0.144186 -0.253205 -0.216874 -0.272020 0.272662 -0.175363 -0.228205 0.586082 -0.166079 -0.131387 0.187998 -0.122671 0.589725 0.146581 0.116330 0.087000 0.079019 0.116212 0.115579 0.100176 0.103377 0.113568 0.104270 0.096397 0.087892 0.089655 0.152514 0.148980 0.158363 0.157130 0.125618 0.125338 0.132631
qa: -0.1749 -0.1753 -0.1668 -0.3204 -0.3334 -0.2892 -0.3153 -0.4653 -0.3469 -0.0296 0.1512 -0.0198 0.1922 0.2129 -0.0838 0.0013 -0.2341 0.1141 -0.1442 -0.2532 -0.2169 -0.2720 0.2727 -0.1754 -0.2282 0.5861 -0.1661 -0.1314 0.1880 -0.1227 0.5897 0.1466 0.1163 0.0870 0.0790 0.1162 0.1156 0.1002 0.1034 0.1136 0.1043 0.0964 0.0879 0.0897 0.1525 0.1490 0.1584 0.1571 0.1256 0.1253 0.1326
va: 1.1241 1.1240 1.1382 2.1265 2.0682 2.1238 2.0749 2.0267 3.1130 3.7595 3.9179 3.7926 3.8073 3.6728 3.8981 3.8608 4.1367 3.8731 3.8817 3.9096 3.8861 3.9157 3.6850 3.8630 4.0017 4.2614 4.0444 4.0100 3.7275 3.8445 4.6155 1.0194 1.0414 1.0034 1.0235 0.9950 0.9912 1.0152 1.0044 0.9990 0.9964 1.0039 1.0068 1.0015 1.0025 1.0075 0.9985 0.9971 0.9907 0.9911 0.9949
dispcorr: -0.025091670 hartree
energy: -1581.036912832839
dipole: -57.22513 56.08443 -1.14069 14.58850 -13.21715 1.37135 -0.82198 0.01698 -0.80500
magnitude: 1.95699 au
magnitude: 4.97428 debye
