program: Orca
programVersion: 5.0.2
elementType: F F F O O O O O N C C C C C C C C C C C C C C C C C C C C C C H H H H H H H H H H H H H H H H H H H H
charge: 0
multiplicity: 1
keywords: wb97x-d3
keywords: def2-TZVPP
keywords: def2/J RIJCOSX
keywords: DEFGRID2
keywords: scfconv7
keywords: smallprint printgap noloewdin
keywords: NOSOSCF
formula: C22H20F3NO5
InChI: InChI=1/C22H20F3NO5/c1-5-17-13(3)20(30-21(27)28-4)16-11-19(12(2)10-18(16)26-17)29-14-6-8-15(9-7-14)31-22(23,24)25/h6-11H,5H2,1-4H3
51 atoms
F  6.263469 -2.325418 -1.081212
F  5.472156 -1.033976 -2.595251
F  7.36054 -0.567782 -1.668454
O  -3.082553 1.845469 2.153382
O  0.577239 -1.59264 1.419938
O  -1.734406 3.032742 0.878533
O  5.57858 -0.284858 -0.49835
O  -1.846587 3.407879 3.093482
N  -4.148368 -0.425742 -1.139424
C  -2.563279 0.077162 0.617435
C  -2.982923 -0.673356 -0.498942
C  -4.594978 1.387687 0.379729
C  -4.921081 0.542031 -0.730632
C  -3.421504 1.124153 1.022646
C  -1.341341 -0.239682 1.243219
C  -0.975051 -2.040246 -0.363278
C  -2.168096 -1.726435 -0.962171
C  -0.581715 -1.26419 0.754146
C  -6.212368 0.776955 -1.461232
C  -5.51418 2.498193 0.779158
C  -0.128129 -3.171688 -0.855419
C  -6.469089 -0.14443 -2.638623
C  1.78234 -1.242086 0.88281
C  1.924085 -0.359163 -0.180037
C  2.9019 -1.809321 1.481616
C  -2.174137 2.82722 2.095384
C  3.193939 -0.060687 -0.656071
C  4.165878 -1.502522 1.012092
C  4.299491 -0.636688 -0.060687
C  -0.700142 4.013441 0.715032
C  6.14712 -1.047378 -1.44448
H  -0.995214 0.298568 2.116683
H  -2.512258 -2.300378 -1.813707
H  -7.034454 0.694958 -0.742604
H  -6.237914 1.818614 -1.796467
H  -5.164257 3.040455 1.653777
H  -5.626153 3.218967 -0.032635
H  -6.511926 2.118618 1.004373
H  0.160085 -3.844493 -0.046729
H  -0.667671 -3.75423 -1.599974
H  0.792178 -2.814839 -1.322388
H  -5.699876 -0.050468 -3.404217
H  -6.511616 -1.19012 -2.336866
H  -7.424782 0.104443 -3.098384
H  1.065004 0.105877 -0.645543
H  2.78303 -2.487309 2.316707
H  3.307979 0.63437 -1.477481
H  5.037317 -1.930263 1.489691
H  -0.491584 4.042271 -0.349644
H  0.200328 3.719405 1.254581
H  -1.032412 4.995867 1.049066
elementType: F O N C H
totalener: -1581.00947467 hartree
nucrepener: 3060.46972811 hartree
electener: -4641.47920277 hartree
oneelecener: -8249.59650648 hartree
twoeener: 3608.11730371 hartree
cpcmener: -0.03545090 hartree
kineticenergy: 1574.73278558 hartree
xcener: -144.851966085947 hartree
chargesum: 0.0000000
charge: -0.175150 -0.175246 -0.167394 -0.310922 -0.333203 -0.264002 -0.315770 -0.464120 -0.361096 -0.031159 0.138298 -0.022133 0.172116 0.236781 -0.098135 0.001030 -0.230243 0.120074 -0.098666 -0.256446 -0.219495 -0.270382 0.277309 -0.178433 -0.230283 0.548638 -0.164302 -0.129518 0.187839 -0.123958 0.590461 0.144536 0.118583 0.092682 0.089773 0.102094 0.113921 0.112492 0.113754 0.103225 0.104536 0.077989 0.076749 0.095404 0.150998 0.148969 0.158217 0.156073 0.130972 0.127967 0.128577
qa: -0.1752 -0.1752 -0.1674 -0.3109 -0.3332 -0.2640 -0.3158 -0.4641 -0.3611 -0.0312 0.1383 -0.0221 0.1721 0.2368 -0.0981 0.0010 -0.2302 0.1201 -0.0987 -0.2564 -0.2195 -0.2704 0.2773 -0.1784 -0.2303 0.5486 -0.1643 -0.1295 0.1878 -0.1240 0.5905 0.1445 0.1186 0.0927 0.0898 0.1021 0.1139 0.1125 0.1138 0.1032 0.1045 0.0780 0.0767 0.0954 0.1510 0.1490 0.1582 0.1561 0.1310 0.1280 0.1286
va: 1.1240 1.1240 1.1372 2.1303 2.0678 2.1028 2.0733 2.0458 3.0821 3.7402 3.9511 3.8474 3.8196 3.6841 3.9213 3.8547 4.1011 3.8633 3.8330 3.9096 3.8853 3.9550 3.6779 3.8640 4.0040 4.3129 4.0469 4.0077 3.7304 3.8295 4.6144 1.0217 1.0377 1.0007 1.0008 1.0144 0.9937 0.9971 0.9989 1.0045 0.9964 1.0082 1.0088 1.0046 1.0026 1.0076 0.9984 0.9975 0.9940 0.9914 0.9932
dispcorr: -0.025420065 hartree
energy: -1581.034894731831
dipole: -58.00430 57.01001 -0.99430 9.88917 -9.18368 0.70549 -2.28703 1.11435 -1.17268
magnitude: 1.69160 au
magnitude: 4.29971 debye
