program: Orca
programVersion: 5.0.2
elementType: F F F O O O O O N C C C C C C C C C C C C C C C C C C C C C C H H H H H H H H H H H H H H H H H H H H
charge: 0
multiplicity: 1
keywords: wb97x-d3
keywords: def2-TZVPP
keywords: def2/J RIJCOSX
keywords: DEFGRID2
keywords: scfconv7
keywords: smallprint printgap noloewdin
keywords: NOSOSCF
formula: C22H20F3NO5
InChI: InChI=1/C22H20F3NO5/c1-5-17-13(3)20(30-21(27)28-4)16-11-19(12(2)10-18(16)26-17)29-14-6-8-15(9-7-14)31-22(23,24)25/h6-11H,5H2,1-4H3
51 atoms
F  7.489899 -2.073432 1.502539
F  6.701397 -0.504602 0.251015
F  5.961577 -0.755481 2.245272
O  -2.407619 2.808521 -0.042988
O  0.817119 -0.696494 -1.69075
O  -2.177452 4.612346 -1.168916
O  5.498757 -2.317704 0.725058
O  -3.66986 3.090202 -1.89024
N  -4.119557 -0.876978 0.737397
C  -2.278972 0.430515 -0.132583
C  -2.897948 -0.801154 0.160954
C  -4.228651 1.526137 0.814455
C  -4.757665 0.216569 1.052068
C  -3.005939 1.589662 0.212552
C  -1.005374 0.442953 -0.734975
C  -0.994837 -1.99719 -0.77315
C  -2.230109 -1.996192 -0.176246
C  -0.394883 -0.740735 -1.039379
C  -6.114384 0.090419 1.685361
C  -5.012987 2.74306 1.19199
C  -0.314702 -3.278227 -1.144319
C  -6.648209 -1.324924 1.798291
C  1.950901 -1.067098 -1.027185
C  3.070009 -1.308849 -1.816637
C  2.02151 -1.201326 0.353047
C  -2.834245 3.480388 -1.121804
C  4.260769 -1.691433 -1.226699
C  3.214743 -1.597246 0.942262
C  4.31915 -1.840755 0.148843
C  -2.522229 5.511957 -2.230203
C  6.388533 -1.418584 1.168689
H  -0.507505 1.376021 -0.965624
H  -2.725134 -2.935378 0.038411
H  -6.076407 0.549021 2.678953
H  -6.820223 0.706171 1.119405
H  -5.854983 2.89203 0.513048
H  -5.426605 2.645675 2.195327
H  -4.413792 3.650925 1.181627
H  0.064931 -3.256557 -2.166396
H  0.532598 -3.491014 -0.489783
H  -1.008495 -4.112884 -1.061751
H  -6.009203 -1.95585 2.41436
H  -7.636075 -1.307056 2.25834
H  -6.748009 -1.801255 0.823541
H  3.007003 -1.202482 -2.891793
H  1.161846 -1.011476 0.982202
H  5.127533 -1.89601 -1.841165
H  3.262586 -1.729597 2.014932
H  -2.352128 5.057638 -3.205043
H  -1.867701 6.369565 -2.112001
H  -3.559325 5.833469 -2.146093
elementType: F O N C H
totalener: -1581.01150437 hartree
nucrepener: 3005.84851659 hartree
electener: -4586.86002095 hartree
oneelecener: -8141.43359641 hartree
twoeener: 3554.57357545 hartree
cpcmener: -0.03346482 hartree
kineticenergy: 1574.74730117 hartree
xcener: -144.854409302877 hartree
chargesum: 0.0000000
charge: -0.167968 -0.173930 -0.176433 -0.321154 -0.333930 -0.288856 -0.314811 -0.465316 -0.361250 -0.036042 0.119394 0.002809 0.184319 0.214156 -0.101417 -0.004138 -0.226852 0.124854 -0.099576 -0.264403 -0.217461 -0.270828 0.278823 -0.226780 -0.188575 0.586576 -0.131005 -0.154953 0.182015 -0.122191 0.589994 0.145714 0.118290 0.093970 0.089739 0.120716 0.115175 0.104877 0.114172 0.105345 0.104413 0.076223 0.094362 0.079232 0.148694 0.154194 0.158117 0.158591 0.123626 0.132892 0.126584
qa: -0.1680 -0.1739 -0.1764 -0.3212 -0.3339 -0.2889 -0.3148 -0.4653 -0.3612 -0.0360 0.1194 0.0028 0.1843 0.2142 -0.1014 -0.0041 -0.2269 0.1249 -0.0996 -0.2644 -0.2175 -0.2708 0.2788 -0.2268 -0.1886 0.5866 -0.1310 -0.1550 0.1820 -0.1222 0.5900 0.1457 0.1183 0.0940 0.0897 0.1207 0.1152 0.1049 0.1142 0.1053 0.1044 0.0762 0.0944 0.0792 0.1487 0.1542 0.1581 0.1586 0.1236 0.1329 0.1266
va: 1.1365 1.1250 1.1227 2.1249 2.0676 2.1247 2.0733 2.0306 3.0841 3.7583 3.9750 3.8207 3.8047 3.6858 3.9303 3.8578 4.1062 3.8437 3.8391 3.9060 3.8827 3.9546 3.6810 3.9974 3.8686 4.2646 4.0072 4.0428 3.7331 3.8438 4.6159 1.0236 1.0376 1.0010 0.9988 0.9932 0.9985 1.0105 0.9990 0.9950 1.0046 1.0090 1.0051 1.0077 1.0075 1.0007 0.9960 0.9994 0.9918 0.9948 0.9904
dispcorr: -0.024604921 hartree
energy: -1581.036109286403
dipole: -63.81749 62.79604 -1.02146 7.38176 -6.03427 1.34749 -4.29854 4.28223 -0.01631
magnitude: 1.69096 au
magnitude: 4.29809 debye
