program: Orca
programVersion: 5.0.2
elementType: F F F O O O O O N C C C C C C C C C C C C C C C C C C C C C C H H H H H H H H H H H H H H H H H H H H
charge: 0
multiplicity: 1
keywords: wb97x-d3
keywords: def2-TZVPP
keywords: def2/J RIJCOSX
keywords: DEFGRID2
keywords: scfconv7
keywords: smallprint printgap noloewdin
keywords: NOSOSCF
formula: C22H20F3NO5
InChI: InChI=1/C22H20F3NO5/c1-5-17-13(3)20(30-21(27)28-4)16-11-19(12(2)10-18(16)26-17)29-14-6-8-15(9-7-14)31-22(23,24)25/h6-11H,5H2,1-4H3
51 atoms
F  6.238112 -2.436862 -1.095079
F  5.359841 -1.2516 -2.648764
F  7.302248 -0.73534 -1.878552
O  -2.998727 2.015368 1.78755
O  0.620119 -1.513586 1.456829
O  -1.941236 3.666667 2.633475
O  5.596472 -0.355734 -0.622267
O  -1.701076 3.263688 0.430147
N  -4.063582 -0.563142 -1.268655
C  -2.49702 0.095189 0.452289
C  -2.913353 -0.761815 -0.587081
C  -4.514331 1.392459 0.063468
C  -4.83094 0.450605 -0.964809
C  -3.348357 1.182687 0.742179
C  -1.286063 -0.166661 1.124458
C  -0.926163 -2.130675 -0.278454
C  -2.105551 -1.867402 -0.926203
C  -0.534839 -1.245424 0.755945
C  -6.114369 0.578435 -1.732456
C  -5.419086 2.551996 0.345942
C  -0.088032 -3.320084 -0.629347
C  -7.265913 -0.145663 -1.035515
C  1.822113 -1.197938 0.89025
C  1.949836 -0.387026 -0.230302
C  2.950066 -1.723018 1.51178
C  -2.156771 3.02236 1.514272
C  3.211971 -0.121642 -0.742288
C  4.20759 -1.451542 1.00324
C  4.325329 -0.660408 -0.127357
C  -1.025301 4.767116 2.58387
C  6.105243 -1.187643 -1.544094
H  -0.945228 0.462423 1.937021
H  -2.443708 -2.523488 -1.718723
H  -6.374499 1.627541 -1.87797
H  -5.967643 0.147464 -2.723084
H  -5.112698 3.118632 1.221586
H  -5.441177 3.240992 -0.499943
H  -6.443523 2.221775 0.516585
H  -0.597636 -3.941441 -1.363168
H  0.873507 -3.028599 -1.056023
H  0.121502 -3.936455 0.245707
H  -7.455159 0.252592 -0.038231
H  -8.184879 -0.042084 -1.61233
H  -7.053844 -1.21007 -0.934152
H  1.084561 0.045135 -0.715044
H  2.843516 -2.343654 2.391892
H  3.31446 0.515451 -1.610668
H  5.085933 -1.849965 1.493407
H  -0.976981 5.153261 3.597054
H  -1.383648 5.5480 1.914976
H  -0.034732 4.437186 2.274483
elementType: F O N C H
totalener: -1581.01206613 hartree
nucrepener: 3041.56956329 hartree
electener: -4622.58162942 hartree
oneelecener: -8212.77901915 hartree
twoeener: 3590.19738973 hartree
cpcmener: -0.03350427 hartree
kineticenergy: 1574.74762356 hartree
xcener: -144.851940141414 hartree
chargesum: -0.0000000
charge: -0.175174 -0.175204 -0.166465 -0.320375 -0.333504 -0.288821 -0.315922 -0.465429 -0.347197 -0.030901 0.147294 -0.017430 0.196413 0.209633 -0.082748 -0.002932 -0.229439 0.116730 -0.146114 -0.257895 -0.215713 -0.269880 0.257656 -0.161296 -0.220183 0.586792 -0.171741 -0.134992 0.190348 -0.122450 0.590671 0.145610 0.116078 0.087737 0.079485 0.102394 0.116515 0.116331 0.102542 0.103119 0.113368 0.089339 0.096385 0.087814 0.152290 0.148889 0.158487 0.156611 0.132427 0.125328 0.125516
qa: -0.1752 -0.1752 -0.1665 -0.3204 -0.3335 -0.2888 -0.3159 -0.4654 -0.3472 -0.0309 0.1473 -0.0174 0.1964 0.2096 -0.0827 -0.0029 -0.2294 0.1167 -0.1461 -0.2579 -0.2157 -0.2699 0.2577 -0.1613 -0.2202 0.5868 -0.1717 -0.1350 0.1903 -0.1224 0.5907 0.1456 0.1161 0.0877 0.0795 0.1024 0.1165 0.1163 0.1025 0.1031 0.1134 0.0893 0.0964 0.0878 0.1523 0.1489 0.1585 0.1566 0.1324 0.1253 0.1255
va: 1.1241 1.1237 1.1389 2.1259 2.0684 2.1234 2.0731 2.0272 3.1135 3.7574 3.9204 3.7907 3.8029 3.6809 3.8975 3.8616 4.1340 3.8688 3.8845 3.9097 3.8886 3.9133 3.6963 3.8549 3.9977 4.2595 4.0499 4.0132 3.7243 3.8452 4.6136 1.0199 1.0411 1.0025 1.0233 1.0142 0.9922 0.9946 1.0045 0.9980 0.9984 1.0020 1.0040 1.0069 1.0027 1.0071 0.9987 0.9972 0.9950 0.9909 0.9906
dispcorr: -0.025049211 hartree
energy: -1581.037115336856
dipole: -60.00059 58.81037 -1.19022 11.55890 -10.44334 1.11555 6.85684 -5.70398 1.15286
magnitude: 1.99754 au
magnitude: 5.07734 debye
