program: Orca
programVersion: 5.0.2
elementType: F F F O O O O O N C C C C C C C C C C C C C C C C C C C C C C H H H H H H H H H H H H H H H H H H H H
charge: 0
multiplicity: 1
keywords: wb97x-d3
keywords: def2-TZVPP
keywords: def2/J RIJCOSX
keywords: DEFGRID2
keywords: scfconv7
keywords: smallprint printgap noloewdin
keywords: NOSOSCF
formula: C22H20F3NO5
InChI: InChI=1/C22H20F3NO5/c1-5-17-13(3)20(30-21(27)28-4)16-11-19(12(2)10-18(16)26-17)29-14-6-8-15(9-7-14)31-22(23,24)25/h6-11H,5H2,1-4H3
51 atoms
F  6.125929 -3.12661 0.042947
F  7.291653 -2.501193 1.74524
F  5.258224 -3.160361 2.000293
O  -2.625205 2.976025 0.005711
O  1.046365 -0.061161 -1.617133
O  -2.543194 4.845068 -1.027635
O  5.725842 -1.190399 1.069039
O  -3.875569 3.230491 -1.853923
N  -3.93697 -0.909156 0.558931
C  -2.228286 0.635901 -0.178972
C  -2.710893 -0.670055 0.039771
C  -4.324779 1.460974 0.727117
C  -4.708586 0.090282 0.887911
C  -3.095049 1.688808 0.182198
C  -0.940995 0.820025 -0.721206
C  -0.645338 -1.599435 -0.850593
C  -1.89586 -1.765499 -0.31167
C  -0.184969 -0.272012 -1.039177
C  -6.066012 -0.214162 1.455925
C  -5.254485 2.563815 1.123613
C  0.194646 -2.777014 -1.237296
C  -6.441163 -1.683408 1.496172
C  2.17051 -0.346857 -0.896657
C  2.168306 -0.521994 0.481103
C  3.355172 -0.439691 -1.61806
C  -3.09275 3.656865 -1.049794
C  3.355067 -0.822442 1.134366
C  4.538676 -0.72892 -0.963598
C  4.524072 -0.929403 0.406419
C  -2.935878 5.755286 -2.06231
C  6.08342 -2.475432 1.205768
H  -0.543644 1.812609 -0.88964
H  -2.285734 -2.763772 -0.155117
H  -6.120323 0.205291 2.466043
H  -6.813753 0.341413 0.881497
H  -4.762703 3.532754 1.171633
H  -6.086424 2.647196 0.421547
H  -5.685733 2.37672 2.106637
H  -0.403671 -3.68637 -1.234053
H  0.625249 -2.661953 -2.232434
H  1.023099 -2.928169 -0.542771
H  -5.761865 -2.262518 2.120333
H  -7.443316 -1.792984 1.910872
H  -6.444929 -2.13037 0.502585
H  1.257648 -0.43372 1.058694
H  3.35033 -0.290215 -2.689757
H  3.357492 -0.956502 2.207907
H  5.463249 -0.792423 -1.521714
H  -4.003663 5.963575 -2.014861
H  -2.675806 5.36877 -3.04653
H  -2.380909 6.669041 -1.874732
elementType: F O N C H
totalener: -1581.01152776 hartree
nucrepener: 3011.91880657 hartree
electener: -4592.93033433 hartree
oneelecener: -8153.54535474 hartree
twoeener: 3560.61502041 hartree
cpcmener: -0.03330035 hartree
kineticenergy: 1574.75941535 hartree
xcener: -144.856653037752 hartree
chargesum: -0.0000000
charge: -0.174489 -0.166962 -0.175999 -0.320828 -0.334859 -0.288946 -0.315585 -0.465477 -0.361409 -0.037927 0.119637 0.001667 0.183376 0.217388 -0.104717 -0.004812 -0.228057 0.130562 -0.099410 -0.263639 -0.217876 -0.271644 0.275195 -0.184114 -0.224484 0.586860 -0.162378 -0.131751 0.187782 -0.122510 0.590747 0.145387 0.118188 0.093767 0.089553 0.105067 0.120331 0.115745 0.104459 0.114650 0.105210 0.076024 0.094944 0.079453 0.153601 0.149522 0.158338 0.157260 0.125762 0.124863 0.132535
qa: -0.1745 -0.1670 -0.1760 -0.3208 -0.3349 -0.2889 -0.3156 -0.4655 -0.3614 -0.0379 0.1196 0.0017 0.1834 0.2174 -0.1047 -0.0048 -0.2281 0.1306 -0.0994 -0.2636 -0.2179 -0.2716 0.2752 -0.1841 -0.2245 0.5869 -0.1624 -0.1318 0.1878 -0.1225 0.5907 0.1454 0.1182 0.0938 0.0896 0.1051 0.1203 0.1157 0.1045 0.1147 0.1052 0.0760 0.0949 0.0795 0.1536 0.1495 0.1583 0.1573 0.1258 0.1249 0.1325
va: 1.1244 1.1380 1.1232 2.1258 2.0674 2.1247 2.0741 2.0311 3.0853 3.7588 3.9758 3.8183 3.8041 3.6860 3.9330 3.8562 4.1077 3.8428 3.8389 3.9070 3.8820 3.9554 3.6795 3.8624 3.9936 4.2648 4.0431 4.0019 3.7301 3.8440 4.6137 1.0240 1.0375 1.0011 0.9990 1.0101 0.9935 0.9985 1.0046 0.9990 0.9953 1.0090 1.0048 1.0075 1.0012 1.0071 0.9988 0.9967 0.9908 0.9912 0.9949
dispcorr: -0.024701957 hartree
energy: -1581.036229714060
dipole: -60.78498 59.75767 -1.02730 15.90030 -14.20089 1.69941 -4.90797 4.96193 0.05396
magnitude: 1.98652 au
magnitude: 5.04932 debye
