program: Orca
programVersion: 5.0.2
elementType: F F F O O O O O N C C C C C C C C C C C C C C C C C C C C C C H H H H H H H H H H H H H H H H H H H H
charge: 0
multiplicity: 1
keywords: wb97x-d3
keywords: def2-TZVPP
keywords: def2/J RIJCOSX
keywords: DEFGRID2
keywords: scfconv7
keywords: smallprint printgap noloewdin
keywords: NOSOSCF
formula: C22H20F3NO5
InChI: InChI=1/C22H20F3NO5/c1-5-17-13(3)20(30-21(27)28-4)16-11-19(12(2)10-18(16)26-17)29-14-6-8-15(9-7-14)31-22(23,24)25/h6-11H,5H2,1-4H3
51 atoms
F  7.366759 -0.548393 -1.578031
F  6.272414 -2.309251 -0.992125
F  5.529499 -1.068534 -2.572107
O  -2.882556 2.069731 1.664784
O  0.551009 -1.648618 1.4271
O  -1.660843 3.666398 2.385201
O  5.532703 -0.26666 -0.49237
O  -1.536228 3.12987 0.200583
N  -4.173023 -0.62433 -1.197835
C  -2.520745 0.053176 0.432389
C  -3.006583 -0.836001 -0.547615
C  -4.486375 1.424318 0.031045
C  -4.885129 0.437408 -0.924662
C  -3.309777 1.195675 0.684217
C  -1.304439 -0.230262 1.08586
C  -1.062055 -2.264166 -0.239732
C  -2.252933 -1.986897 -0.860419
C  -0.609078 -1.354645 0.746004
C  -6.1963 0.572475 -1.642924
C  -5.321037 2.644777 0.267536
C  -0.268434 -3.489368 -0.567487
C  -7.342704 -0.043261 -0.841029
C  1.751422 -1.295383 0.881367
C  1.878286 -0.497775 -0.248649
C  2.882299 -1.767892 1.539592
C  -1.97109 2.985967 1.310273
C  3.143672 -0.176496 -0.721557
C  4.141327 -1.442324 1.069173
C  4.260445 -0.651069 -0.061541
C  -0.664335 4.685544 2.239527
C  6.152815 -1.042851 -1.392466
H  -0.915405 0.41648 1.862106
H  -2.640117 -2.663244 -1.612417
H  -6.416364 1.619724 -1.853991
H  -6.117369 0.064585 -2.60428
H  -6.347543 2.379337 0.52023
H  -4.938684 3.263473 1.075378
H  -5.362859 3.264923 -0.629283
H  -0.072118 -4.091037 0.320827
H  -0.803395 -4.111427 -1.282409
H  0.698964 -3.238278 -1.006663
H  -7.468701 0.43931 0.128861
H  -8.2831 0.056037 -1.383153
H  -7.170457 -1.105164 -0.664607
H  1.010789 -0.111159 -0.766655
H  2.776326 -2.384535 2.42259
H  3.24337 0.458898 -1.591508
H  5.020586 -1.794481 1.592106
H  -0.549135 5.125416 3.225075
H  -0.984636 5.452203 1.535664
H  0.28549 4.259461 1.919533
elementType: F O N C H
totalener: -1581.01206812 hartree
nucrepener: 3044.83302400 hartree
electener: -4625.84509213 hartree
oneelecener: -8219.27857066 hartree
twoeener: 3593.43347853 hartree
cpcmener: -0.03350135 hartree
kineticenergy: 1574.74478366 hartree
xcener: -144.851217929465 hartree
chargesum: -0.0000000
charge: -0.167727 -0.175033 -0.175921 -0.319889 -0.332124 -0.288735 -0.315578 -0.464544 -0.346592 -0.028955 0.151825 -0.023086 0.195649 0.213602 -0.080494 -0.001390 -0.232403 0.115087 -0.142267 -0.257403 -0.220513 -0.270004 0.266349 -0.162894 -0.224720 0.585138 -0.174588 -0.135671 0.192237 -0.122599 0.590357 0.146846 0.116065 0.086398 0.079021 0.115916 0.102045 0.116118 0.112184 0.101604 0.104279 0.089220 0.096240 0.088070 0.151654 0.148772 0.158355 0.156745 0.132740 0.124898 0.125717
qa: -0.1677 -0.1750 -0.1759 -0.3199 -0.3321 -0.2887 -0.3156 -0.4645 -0.3466 -0.0290 0.1518 -0.0231 0.1956 0.2136 -0.0805 -0.0014 -0.2324 0.1151 -0.1423 -0.2574 -0.2205 -0.2700 0.2663 -0.1629 -0.2247 0.5851 -0.1746 -0.1357 0.1922 -0.1226 0.5904 0.1468 0.1161 0.0864 0.0790 0.1159 0.1020 0.1161 0.1122 0.1016 0.1043 0.0892 0.0962 0.0881 0.1517 0.1488 0.1584 0.1567 0.1327 0.1249 0.1257
va: 1.1366 1.1239 1.1234 2.1260 2.0705 2.1235 2.0736 2.0277 3.1131 3.7519 3.9135 3.7924 3.8054 3.6787 3.8884 3.8611 4.1361 3.8708 3.8834 3.9108 3.8959 3.9129 3.6890 3.8634 4.0035 4.2613 4.0578 4.0134 3.7227 3.8447 4.6151 1.0186 1.0411 1.0032 1.0238 0.9945 1.0144 0.9921 0.9980 1.0045 0.9976 1.0022 1.0041 1.0066 1.0036 1.0073 0.9991 0.9971 0.9949 0.9912 0.9905
dispcorr: -0.025015658 hartree
energy: -1581.037083779208
dipole: -60.33846 59.19350 -1.14496 10.65096 -9.51936 1.13160 6.09287 -5.01105 1.08181
magnitude: 1.93953 au
magnitude: 4.92990 debye
