program: Orca
programVersion: 5.0.2
elementType: F F F O O O O O N C C C C C C C C C C C C C C C C C C C C C C H H H H H H H H H H H H H H H H H H H H
charge: 0
multiplicity: 1
keywords: wb97x-d3
keywords: def2-TZVPP
keywords: def2/J RIJCOSX
keywords: DEFGRID2
keywords: scfconv7
keywords: smallprint printgap noloewdin
keywords: NOSOSCF
formula: C22H20F3NO5
InChI: InChI=1/C22H20F3NO5/c1-5-17-13(3)20(30-21(27)28-4)16-11-19(12(2)10-18(16)26-17)29-14-6-8-15(9-7-14)31-22(23,24)25/h6-11H,5H2,1-4H3
51 atoms
F  6.298312 -2.350952 -1.007091
F  5.54616 -1.142593 -2.607927
F  7.390444 -0.603754 -1.635972
O  -2.864148 2.042665 1.871012
O  0.580608 -1.645164 1.395557
O  -1.696583 3.670026 2.61191
O  5.562084 -0.297954 -0.546334
O  -1.633109 3.230983 0.403544
N  -4.222093 -0.551331 -1.054276
C  -2.515719 0.085284 0.538743
C  -3.028576 -0.772304 -0.455317
C  -4.51243 1.440612 0.26709
C  -4.934802 0.487888 -0.716711
C  -3.310784 1.205593 0.866549
C  -1.277048 -0.212253 1.141149
C  -1.068179 -2.199279 -0.259013
C  -2.278484 -1.905061 -0.833733
C  -0.58962 -1.323894 0.744858
C  -6.259783 0.698166 -1.391663
C  -5.371684 2.620557 0.594447
C  -0.283611 -3.410966 -0.652793
C  -6.652988 -0.35634 -2.408499
C  1.779058 -1.298145 0.843712
C  1.90669 -0.502151 -0.2872
C  2.909226 -1.777837 1.498047
C  -2.014856 3.018336 1.521579
C  3.17277 -0.190848 -0.765497
C  4.168681 -1.461144 1.023318
C  4.288728 -0.671997 -0.108648
C  -0.77211 4.756693 2.468452
C  6.177017 -1.092833 -1.433016
H  -0.868292 0.410768 1.926581
H  -2.685841 -2.556536 -1.597012
H  -7.031739 0.766667 -0.618408
H  -6.252614 1.684673 -1.866438
H  -6.354885 2.301848 0.943959
H  -4.942499 3.255339 1.365236
H  -5.53523 3.238889 -0.289498
H  -0.836921 -4.006124 -1.376669
H  0.672408 -3.143602 -1.10698
H  -0.065153 -4.045906 0.206738
H  -6.728974 -1.346634 -1.96082
H  -7.627234 -0.110766 -2.830904
H  -5.942747 -0.415794 -3.232325
H  1.039238 -0.111428 -0.80244
H  2.802278 -2.393112 2.381853
H  3.27442 0.441281 -1.63763
H  5.047072 -1.818406 1.544158
H  -0.645267 5.16674 3.465432
H  -1.16886 5.526443 1.808214
H  0.188974 4.405677 2.095617
elementType: F O N C H
totalener: -1581.01229719 hartree
nucrepener: 3036.12086360 hartree
electener: -4617.13316079 hartree
oneelecener: -8202.00380034 hartree
twoeener: 3584.87063954 hartree
cpcmener: -0.03366400 hartree
kineticenergy: 1574.73881386 hartree
xcener: -144.851993698550 hartree
chargesum: -0.0000000
charge: -0.175182 -0.175988 -0.167712 -0.320397 -0.330913 -0.289547 -0.315378 -0.465731 -0.360473 -0.030375 0.130340 -0.008092 0.169400 0.220602 -0.074293 0.003275 -0.233876 0.108886 -0.096559 -0.252460 -0.221450 -0.273119 0.276043 -0.170675 -0.232487 0.587189 -0.169973 -0.132768 0.189214 -0.123020 0.590425 0.147002 0.118837 0.091784 0.091437 0.113353 0.100781 0.113537 0.100997 0.104524 0.112229 0.078321 0.095214 0.077577 0.151689 0.148721 0.158575 0.156751 0.132850 0.125136 0.125780
qa: -0.1752 -0.1760 -0.1677 -0.3204 -0.3309 -0.2895 -0.3154 -0.4657 -0.3605 -0.0304 0.1303 -0.0081 0.1694 0.2206 -0.0743 0.0033 -0.2339 0.1089 -0.0966 -0.2525 -0.2214 -0.2731 0.2760 -0.1707 -0.2325 0.5872 -0.1700 -0.1328 0.1892 -0.1230 0.5904 0.1470 0.1188 0.0918 0.0914 0.1134 0.1008 0.1135 0.1010 0.1045 0.1122 0.0783 0.0952 0.0776 0.1517 0.1487 0.1586 0.1568 0.1328 0.1251 0.1258
va: 1.1237 1.1233 1.1367 2.1258 2.0708 2.1230 2.0738 2.0263 3.0852 3.7569 3.9646 3.8426 3.8237 3.6611 3.8986 3.8511 4.1048 3.8753 3.8298 3.9091 3.8947 3.9566 3.6806 3.8666 4.0080 4.2601 4.0523 4.0098 3.7261 3.8447 4.6150 1.0189 1.0372 1.0007 1.0004 0.9970 1.0148 0.9940 1.0046 0.9974 0.9979 1.0077 1.0047 1.0083 1.0033 1.0076 0.9988 0.9972 0.9949 0.9912 0.9906
dispcorr: -0.024625238 hartree
energy: -1581.036922430055
dipole: -59.38422 58.17296 -1.21127 10.72174 -9.56122 1.16051 3.38614 -2.28441 1.10173
magnitude: 2.00693 au
magnitude: 5.10121 debye
