program: Orca
programVersion: 5.0.2
elementType: F F F O O O O O N C C C C C C C C C C C C C C C C C C C C C C H H H H H H H H H H H H H H H H H H H H
charge: 0
multiplicity: 1
keywords: wb97x-d3
keywords: def2-TZVPP
keywords: def2/J RIJCOSX
keywords: DEFGRID2
keywords: scfconv7
keywords: smallprint printgap noloewdin
keywords: NOSOSCF
formula: C22H20F3NO5
InChI: InChI=1/C22H20F3NO5/c1-5-17-13(3)20(30-21(27)28-4)16-11-19(12(2)10-18(16)26-17)29-14-6-8-15(9-7-14)31-22(23,24)25/h6-11H,5H2,1-4H3
51 atoms
F  7.214218 0.346959 1.195329
F  5.880947 -1.162818 1.961295
F  6.655068 -1.336712 -0.02645
O  -1.877737 2.191859 0.162526
O  0.504793 -2.182658 -1.008149
O  -0.787198 3.649159 -0.95374
O  5.210194 0.301947 0.421764
O  -2.369833 2.454296 -2.022103
N  -4.570606 -0.90766 0.66768
C  -2.36055 -0.144653 0.046502
C  -3.310817 -1.165406 0.252714
C  -4.077167 1.44912 0.697495
C  -4.9440 0.32698 0.881428
C  -2.804183 1.173203 0.286743
C  -1.056353 -0.475181 -0.373128
C  -1.663827 -2.838053 -0.381606
C  -2.929284 -2.503849 0.022369
C  -0.728905 -1.788991 -0.569345
C  -6.3701 0.533878 1.303872
C  -4.55897 2.840702 0.967013
C  -1.26374 -4.259733 -0.621381
C  -7.296263 0.726264 0.104648
C  1.638842 -1.524723 -0.618284
C  2.632558 -1.367077 -1.573064
C  1.831593 -1.085877 0.686074
C  -1.733538 2.748427 -1.047376
C  3.837293 -0.777892 -1.222725
C  3.031154 -0.487104 1.032978
C  4.021523 -0.343987 0.076987
C  -0.444201 4.354426 -2.153154
C  6.215195 -0.459937 0.878188
H  -0.316724 0.299507 -0.529416
H  -3.666225 -3.281253 0.181857
H  -6.69149 -0.342069 1.867948
H  -6.455044 1.39029 1.973716
H  -3.809922 3.597435 0.748355
H  -5.441723 3.073297 0.370849
H  -4.840359 2.957513 2.014606
H  -0.957719 -4.424002 -1.655743
H  -0.426339 -4.55657 0.011857
H  -2.09526 -4.9297 -0.41096
H  -7.025576 1.604763 -0.482296
H  -7.266346 -0.139221 -0.557516
H  -8.326502 0.855284 0.436796
H  2.470291 -1.709149 -2.586725
H  1.062378 -1.208389 1.43691
H  4.610841 -0.64279 -1.966773
H  3.182631 -0.131096 2.043298
H  -0.081425 3.670642 -2.919298
H  0.351029 5.03809 -1.873719
H  -1.292894 4.921613 -2.532609
elementType: F O N C H
totalener: -1581.01173018 hartree
nucrepener: 3052.43147490 hartree
electener: -4633.44320507 hartree
oneelecener: -8234.45327570 hartree
twoeener: 3601.01007063 hartree
cpcmener: -0.03456444 hartree
kineticenergy: 1574.75695482 hartree
xcener: -144.854418238409 hartree
chargesum: -0.0000000
charge: -0.166410 -0.174461 -0.175135 -0.320319 -0.340497 -0.290384 -0.314040 -0.466337 -0.350162 -0.020869 0.102394 -0.031275 0.201303 0.227847 -0.135416 -0.074867 -0.190237 0.236081 -0.145035 -0.255001 -0.240189 -0.270909 0.318634 -0.260428 -0.207026 0.584530 -0.116994 -0.134779 0.177449 -0.123819 0.590065 0.162368 0.114780 0.079268 0.086124 0.098343 0.115932 0.115482 0.105526 0.103706 0.098508 0.088836 0.086792 0.096253 0.151707 0.161302 0.158430 0.158912 0.125363 0.132391 0.126264
qa: -0.1664 -0.1745 -0.1751 -0.3203 -0.3405 -0.2904 -0.3140 -0.4663 -0.3502 -0.0209 0.1024 -0.0313 0.2013 0.2278 -0.1354 -0.0749 -0.1902 0.2361 -0.1450 -0.2550 -0.2402 -0.2709 0.3186 -0.2604 -0.2070 0.5845 -0.1170 -0.1348 0.1774 -0.1238 0.5901 0.1624 0.1148 0.0793 0.0861 0.0983 0.1159 0.1155 0.1055 0.1037 0.0985 0.0888 0.0868 0.0963 0.1517 0.1613 0.1584 0.1589 0.1254 0.1324 0.1263
va: 1.1389 1.1244 1.1246 2.1264 2.0788 2.1206 2.0744 2.0256 3.1188 3.8077 3.9625 3.8005 3.7886 3.6720 3.8250 3.8770 4.1009 3.8240 3.8835 3.9158 3.9221 3.9154 3.6589 4.0428 3.9453 4.2651 3.9893 3.9952 3.7464 3.8459 4.6159 1.0040 1.0398 1.0228 1.0039 1.0147 0.9906 0.9953 0.9956 0.9981 1.0036 1.0016 1.0075 1.0039 1.0057 0.9940 0.9969 0.9977 0.9907 0.9952 0.9906
dispcorr: -0.024446080 hartree
energy: -1581.036176254999
dipole: -62.66140 62.38565 -0.27575 7.96798 -6.73204 1.23594 -6.88316 6.86155 -0.02161
magnitude: 1.26652 au
magnitude: 3.21923 debye
